[parsec-users] please guide me: some errors for vips and ferret

fahimeh at ac.upc.edu fahimeh at ac.upc.edu
Tue Jan 13 07:46:01 EST 2009


Hello,

Thank you for your emails, my problem bout dedup has been solved. I am working
on Parsec Packages, I must use them for a project, but I have some errors in
building of ferret and vips. the errors are as follows, Would you please me to
solve these errors?

1) ./parsecmgmt -a build -p ferret
...
 *** No rule to make target `copy.lo', needed by `libgslvector.la'.  Stop.
make[2]: Leaving directory
`/home/parsec-1.0/pkgs/libs/gsl/obj/i486-linux.gcc/vector'
make[1]: *** [all-recursive] Error 1
make[1]: Leaving directory `/home/parsec-1.0/pkgs/libs/gsl/obj/i486-linux.gcc'
make: *** [all] Error 2
[PARSEC] Error: 'env make' failed.


and when I use make, this error is reported:
ferret/src/src/cuckoo_hash.c:85: error: static declaration of ‘ckh_get_size’
follows non-static declaration




2) VIPS:

./configure
make
...
No rule to make target `im_copy.3', needed by `all-am'.  Stop.
make[4]: Leaving directory
`/home/parsec-1.0/pkgs/apps/vips/src/libsrc/conversion/man3'
make[3]: *** [all-recursive] Error 1
make[3]: Leaving directory
`/home/parsec-1.0/pkgs/apps/vips/src/libsrc/conversion'
make[2]: *** [all-recursive] Error 1
make[2]: Leaving directory `/home/parsec-1.0/pkgs/apps/vips/src/libsrc'
make[1]: *** [all-recursive] Error 1
make[1]: Leaving directory `/home/parsec-1.0/pkgs/apps/vips/src'
make: *** [all] Error 2

these errors are reported when I use ./parsecmgmt -a build -p vips, too.

I really appreciated your helps.
Kind regards,
Fahimeh


More information about the parsec-users mailing list