[parsec-users] libxml2 (Fwd: some errors for vips and ferret)

fahimeh at ac.upc.edu fahimeh at ac.upc.edu
Tue Jan 13 09:43:31 EST 2009


Hi,

I think the errors about ferret and vips related to libxml2. I have libxml2
2.6.32 on my system. If I run parsecmgmt -a built -p libxml2, the following
error i reported:

In function 'open',
    inlined from 'xmlNanoHTTPSave' at
/home/parsec-1.0/bin/../pkgs/libs/libxml2/src/nanohttp.c:1588:
/usr/include/bits/fcntl2.h:51: error: call to '__open_missing_mode' declared
with attribute error: open with O_CREAT in second argument needs 3 arguments
make[2]: *** [nanohttp.lo] Error 1

Please guide me to solve this problem.

thanks a lot
fahimeh

----- Forwarded message from fahimeh at ac.upc.edu -----
    Date: Tue, 13 Jan 2009 13:46:01 +0100
    From: fahimeh at ac.upc.edu
Reply-To: PARSEC Users <parsec-users at lists.cs.princeton.edu>
 Subject: [parsec-users] please guide me: some errors for vips and ferret
      To: PARSEC Users <parsec-users at lists.cs.princeton.edu>


Hello,

Thank you for your emails, my problem bout dedup has been solved. I am working
on Parsec Packages, I must use them for a project, but I have some errors in
building of ferret and vips. the errors are as follows, Would you please me to
solve these errors?

1) ./parsecmgmt -a build -p ferret
...
 *** No rule to make target `copy.lo', needed by `libgslvector.la'.  Stop.
make[2]: Leaving directory
`/home/parsec-1.0/pkgs/libs/gsl/obj/i486-linux.gcc/vector'
make[1]: *** [all-recursive] Error 1
make[1]: Leaving directory `/home/parsec-1.0/pkgs/libs/gsl/obj/i486-linux.gcc'
make: *** [all] Error 2
[PARSEC] Error: 'env make' failed.


and when I use make, this error is reported:
ferret/src/src/cuckoo_hash.c:85: error: static declaration of ‘ckh_get_size’
follows non-static declaration




2) VIPS:

./configure
make
...
No rule to make target `im_copy.3', needed by `all-am'.  Stop.
make[4]: Leaving directory
`/home/parsec-1.0/pkgs/apps/vips/src/libsrc/conversion/man3'
make[3]: *** [all-recursive] Error 1
make[3]: Leaving directory
`/home/parsec-1.0/pkgs/apps/vips/src/libsrc/conversion'
make[2]: *** [all-recursive] Error 1
make[2]: Leaving directory `/home/parsec-1.0/pkgs/apps/vips/src/libsrc'
make[1]: *** [all-recursive] Error 1
make[1]: Leaving directory `/home/parsec-1.0/pkgs/apps/vips/src'
make: *** [all] Error 2

these errors are reported when I use ./parsecmgmt -a build -p vips, too.

I really appreciated your helps.
Kind regards,
Fahimeh
_______________________________________________
parsec-users mailing list
parsec-users at lists.cs.princeton.edu
https://lists.cs.princeton.edu/mailman/listinfo/parsec-users

----- End forwarded message -----




More information about the parsec-users mailing list