[parsec-users] error in building the benchmarks

Mahmood Naderan nt_mahmood at yahoo.com
Sun Apr 18 06:24:20 EDT 2010


Hi,
I cannot build benchmark because of this error:
mahmood at Saturn:bin$ ./parsecmgmt -a build
.........
.........
/usr/local/bin/ar cru .libs/libflex.a  FlexImage.o FlexIO.o
../libtool: line 5949: /usr/local/bin/ar: No such file or directory
make[2]: *** [libflex.la] Error 127
make[2]: Leaving directory `/home/mahmood/PARSEC/parsec-2.1/pkgs/apps/bodytrack/obj/amd64-linux.gcc/FlexImageLib'
make[1]: *** [all-recursive] Error 1
make[1]: Leaving directory `/home/mahmood/PARSEC/parsec-2.1/pkgs/apps/bodytrack/obj/amd64-linux.gcc'
make: *** [all] Error 2
[PARSEC] Error: 'env CXXFLAGS=-O3 -funroll-loops -fprefetch-loop-arrays -fpermissive -fno-exceptions -static-libgcc -Wl,--hash-style=both,--as-needed -DPARSEC_VERSION=2.1 -fexceptions /usr/bin/make' failed.


How can I resolve that? thanks,


// Naderan *Mahmood;



      
-------------- next part --------------
An HTML attachment was scrubbed...
URL: <http://lists.cs.princeton.edu/pipermail/parsec-users/attachments/20100418/08d57184/attachment.htm>


More information about the parsec-users mailing list