[parsec-users] bodytrack compilation errors on OpenSolaris

kishore kumar kishoreguptaos at gmail.com
Fri May 14 06:40:51 EDT 2010


Hi,
I compiled most of PARSEC workloads, but bodytrack compilation is giving the
following errors on OpenSolaris. Please help me.

$./bin/parsecmgmt -a build -p bodytrack -c gcc-pthreads -i native -n 4
....
....
...
/bin/sh ../libtool --tag=CXX --mode=link /bin/g++  -O3 -funroll-loops
-fpermissive -fno-exceptions -I/usr/sfw/include -DPARSEC_VERSION=2.1
-fexceptions -Wall -Wno-unknown-pragmas  -L/lib64 -L/lib -L/usr/sfw/lib -o
bodytrack  AnnealingFactor.o BodyGeometry.o BodyPose.o CameraModel.o
CovarianceMatrix.o ImageMeasurements.o ImageProjection.o RandomGenerator.o
TrackingModel.o main.o  TrackingModelPthread.o AsyncIO.o  ../FlexImageLib/
libflex.la -lm threads/libthreads.la  -lpthread
mkdir .libs

/bin/g++ -O3 -funroll-loops -fpermissive -fno-exceptions -I/usr/sfw/include
-DPARSEC_VERSION=2.1 -fexceptions -Wall -Wno-unknown-pragmas -o bodytrack
AnnealingFactor.o BodyGeometry.o BodyPose.o CameraModel.o CovarianceMatrix.o
ImageMeasurements.o ImageProjection.o RandomGenerator.o TrackingModel.o
main.o TrackingModelPthread.o AsyncIO.o  -L/lib64 -L/lib -L/usr/sfw/lib
../FlexImageLib/.libs/libflex.a threads/.libs/libthreads.a
/usr/sfw/lib/libstdc++.so -lgcc_s -lm -lpthread   -Wl,--rpath
-Wl,/usr/sfw/lib -Wl,--rpath -Wl,/usr/sfw/lib
usage: ld [-6:abc:d:e:f:h:il:mo:p:rstu:z:B:CD:F:GI:L:M:N:P:Q:R:S:VW:Y:?]
file(s)
    [-64]        enforce a 64-bit link-edit
    [-a]        create an absolute file
    [-b]        do not do special PIC relocations in a.out
   ....
......
......
collect2: ld returned 1 exit status
gmake[3]: *** [bodytrack] Error 1
gmake[3]: Leaving directory
`/export/home/kishore/parsec-full/parsec-2.1/pkgs/apps/bodytrack/obj/i386-solaris.gcc-pthreads/TrackingBenchmark'
gmake[2]: *** [all-recursive] Error 1
gmake[2]: Leaving directory
`/export/home/kishore/parsec-full/parsec-2.1/pkgs/apps/bodytrack/obj/i386-solaris.gcc-pthreads/TrackingBenchmark'
gmake[1]: *** [all-recursive] Error 1
gmake[1]: Leaving directory
`/export/home/kishore/parsec-full/parsec-2.1/pkgs/apps/bodytrack/obj/i386-solaris.gcc-pthreads'
gmake: *** [all] Error 2
[PARSEC] Error: 'env CXXFLAGS=-O3 -funroll-loops -fpermissive
-fno-exceptions  -I/usr/sfw/include -DPARSEC_VERSION=2.1 -fexceptions
/usr/sfw/bin/gmake' failed.

Best,
Kishore Kumar Pusukuri
http://www.cs.ucr.edu/~kishore
-------------- next part --------------
An HTML attachment was scrubbed...
URL: <http://lists.cs.princeton.edu/pipermail/parsec-users/attachments/20100514/3130ada9/attachment.html>


More information about the parsec-users mailing list