[parsec-users] Compiling using icc

abhishek rnath abhishekrnath at gmail.com
Mon Jul 4 04:58:26 EDT 2011


Hi friends,

Can you please help me in solving these errors. I am using icc.bldconf for
building and running the benchmark.

*bodytrack, x264, vips, ferret *show the following error:

ipo: warning #11010: file format not recognized for
/opt/intel/composerxe-2011.4.191/bin/intel64/
ld: cannot find /opt/intel/composerxe-2011.4.191/bin/intel64/: File format
not recognized
make[2]: *** [glib-genmarshal] Error 1
make[2]: Leaving directory
`/home/abhishekrnath/parsec-2.1/pkgs/libs/glib/obj/amd64-linux.icc/gobject'
make[1]: *** [all-recursive] Error 1
make: *** [all] Error 2
make[1]: Leaving directory
`/home/abhishekrnath/parsec-2.1/pkgs/libs/glib/obj/amd64-linux.icc'
[PARSEC] Error: 'env /usr/bin/make' failed.

*freqmine* can be compiled but cannot run:

[PARSEC] [---------- Beginning of output ----------]
/home/abhishekrnath/parsec-2.1/bin/../pkgs/apps/freqmine/inst/amd64-linux.icc/bin/freqmine:
error while loading shared libraries: libiomp5.so: cannot open shared object
file: No such file or directory

*dedup* has no change, same error:

md5-x86_64.s:571: Error: 0xf7537e82 out range of signed 32bit displacement
md5-x86_64.s:580: Error: 0xbd3af235 out range of signed 32bit displacement
md5-x86_64.s:598: Error: 0xeb86d391 out range of signed 32bit displacement
make[2]: *** [md5-x86_64.o] Error 1
make[2]: Leaving directory
`/home/abhishekrnath/parsec-2.1/pkgs/libs/ssl/obj/amd64-linux.icc/crypto/md5'
make[1]: *** [subdirs] Error 1
make[1]: Leaving directory
`/home/abhishekrnath/parsec-2.1/pkgs/libs/ssl/obj/amd64-linux.icc/crypto'
make: *** [build_crypto] Error 1
[PARSEC] Error: 'env
PATH=/bin:/home/abhishekrnath/parsec-2.1/bin/../bin:/usr/local/sbin:/usr/local/bin:/usr/sbin:/usr/bin:/sbin:/bin:/usr/games:/opt/x86_open64-4.2.5.1/bin:/opt/intel/composerxe-2011.4.191/bin/intel64/:/usr/java/jre1.6.0_26/bin/
/usr/bin/make' failed.

*raytrace* can be 'configure' but cannot 'make'

CMake Error: The following variables are used in this project, but they are
set to NOTFOUND.
Please set them or make sure they are set and tested correctly in the CMake
files:
GLUT_INCLUDE_DIR (ADVANCED)
   used as include directory in directory
/home/abhishekrnath/parsec-2.1/pkgs/apps/raytrace/obj/amd64-linux.icc
   used as include directory in directory
/home/abhishekrnath/parsec-2.1/pkgs/apps/raytrace/obj/amd64-linux.icc/RTTL
   used as include directory in directory
/home/abhishekrnath/parsec-2.1/pkgs/apps/raytrace/obj/amd64-linux.icc/LRT
   used as include directory in directory
/home/abhishekrnath/parsec-2.1/pkgs/apps/raytrace/obj/amd64-linux.icc/MiniView
GLUT_glut_LIBRARY (ADVANCED)
    linked by target "test_glut" in directory
/home/abhishekrnath/parsec-2.1/pkgs/apps/raytrace/obj/amd64-linux.icc
    linked by target "LRT" in directory
/home/abhishekrnath/parsec-2.1/pkgs/apps/raytrace/obj/amd64-linux.icc/LRT
    linked by target "test_static_cube" in directory
/home/abhishekrnath/parsec-2.1/pkgs/apps/raytrace/obj/amd64-linux.icc/LRT
    linked by target "rtview" in directory
/home/abhishekrnath/parsec-2.1/pkgs/apps/raytrace/obj/amd64-linux.icc/MiniView
OPENGL_INCLUDE_DIR (ADVANCED)
   used as include directory in directory
/home/abhishekrnath/parsec-2.1/pkgs/apps/raytrace/obj/amd64-linux.icc
   used as include directory in directory
/home/abhishekrnath/parsec-2.1/pkgs/apps/raytrace/obj/amd64-linux.icc/RTTL
   used as include directory in directory
/home/abhishekrnath/parsec-2.1/pkgs/apps/raytrace/obj/amd64-linux.icc/LRT
   used as include directory in directory
/home/abhishekrnath/parsec-2.1/pkgs/apps/raytrace/obj/amd64-linux.icc/MiniView
OPENGL_gl_LIBRARY (ADVANCED)
    linked by target "test_glut" in directory
/home/abhishekrnath/parsec-2.1/pkgs/apps/raytrace/obj/amd64-linux.icc
    linked by target "LRT" in directory
/home/abhishekrnath/parsec-2.1/pkgs/apps/raytrace/obj/amd64-linux.icc/LRT
    linked by target "test_static_cube" in directory
/home/abhishekrnath/parsec-2.1/pkgs/apps/raytrace/obj/amd64-linux.icc/LRT
    linked by target "rtview" in directory
/home/abhishekrnath/parsec-2.1/pkgs/apps/raytrace/obj/amd64-linux.icc/MiniView
OPENGL_glu_LIBRARY (ADVANCED)
    linked by target "test_glut" in directory
/home/abhishekrnath/parsec-2.1/pkgs/apps/raytrace/obj/amd64-linux.icc
    linked by target "LRT" in directory
/home/abhishekrnath/parsec-2.1/pkgs/apps/raytrace/obj/amd64-linux.icc/LRT
    linked by target "test_static_cube" in directory
/home/abhishekrnath/parsec-2.1/pkgs/apps/raytrace/obj/amd64-linux.icc/LRT
    linked by target "rtview" in directory
/home/abhishekrnath/parsec-2.1/pkgs/apps/raytrace/obj/amd64-linux.icc/MiniView

-- Configuring done
[PARSEC] Error: 'env
CXXFLAGS=-I/home/abhishekrnath/parsec-2.1/bin/../pkgs/libs/mesa/inst/amd64-linux.icc/include
 -O3 -no-prec-div -fpermissive -fno-exceptions -DPARSEC_VERSION=2.1
-fexceptions -fno-strict-aliasing -fno-align-labels -DNDEBUG
-D_MM_NO_ALIGN_CHECK
LDFLAGS=-L/home/abhishekrnath/parsec-2.1/bin/../pkgs/libs/mesa/inst/amd64-linux.icc/lib
-L/usr/lib64 -L/usr/lib LIBS=-L
/opt/intel/composerxe-2011.4.191/bin/intel64/ -lXmu -lX11 -lGL -lGLU
-lpthread ./configure
--prefix=/home/abhishekrnath/parsec-2.1/bin/../pkgs/apps/raytrace/inst/amd64-linux.icc'
failed.





Thank You
Abhishek R. Nath
-------------- next part --------------
An HTML attachment was scrubbed...
URL: <http://lists.cs.princeton.edu/pipermail/parsec-users/attachments/20110704/d800963e/attachment.html>


More information about the parsec-users mailing list