[parsec-users] md5-x86_64.s:41: Error: 0xd76aa478 out range of signed 32bit displacement

Juan Carlos Martinez Santos juanc.martinez.santos at gmail.com
Mon Mar 21 09:41:10 EDT 2011


Hi Wei,

I had the same problem once, but after patching, it works fine.

This is the link:
http://parsec.cs.princeton.edu/download/2.1/bugfixes/parsec-ocreat.patch

Regards,

--
Juan Carlos

2011/3/21 Wei <jasper8717 at gmail.com>

>  Hi all,
>
> When I ran "./parsecmgmt -a build -p dedup", I got the following error.
> Could somebody help me? Thanks a lot.
>
>
> --------------------------------------------------------------------------------------
>
> make[2]: Entering directory `/home/whu/parsec/parsec-2.1/pkgs/libs/ssl/obj/amd64-linux.gcc/crypto/md5'
>
> gcc -I.. -I../.. -I../../include -DOPENSSL_THREADS -D_REENTRANT -DDSO_DLFCN -DHAVE_DLFCN_H -m64 -DL_ENDIAN -DTERMIO -O3 -Wall -DMD32_REG_T=int -DOPENSSL_BN_ASM_MONT -DSHA1_ASM -DSHA256_ASM -DSHA512_ASM -DMD5_ASM -DAES_ASM   -c -o md5_dgst.o md5_dgst.c
>
> gcc -I.. -I../.. -I../../include -DOPENSSL_THREADS -D_REENTRANT -DDSO_DLFCN -DHAVE_DLFCN_H -m64 -DL_ENDIAN -DTERMIO -O3 -Wall -DMD32_REG_T=int -DOPENSSL_BN_ASM_MONT -DSHA1_ASM -DSHA256_ASM -DSHA512_ASM -DMD5_ASM -DAES_ASM   -c -o md5_one.o md5_one.c
> /usr/bin/perl asm/md5-x86_64.pl md5-x86_64.s
>
> gcc -I.. -I../.. -I../../include -DOPENSSL_THREADS -D_REENTRANT -DDSO_DLFCN -DHAVE_DLFCN_H -m64 -DL_ENDIAN -DTERMIO -O3 -Wall -DMD32_REG_T=int -DOPENSSL_BN_ASM_MONT -DSHA1_ASM -DSHA256_ASM -DSHA512_ASM -DMD5_ASM -DAES_ASM -c  -o md5-x86_64.o md5-x86_64.s
> md5-x86_64.s: Assembler messages:
> md5-x86_64.s:41: Error: 0xd76aa478 out range of signed 32bit displacement
> md5-x86_64.s:50: Error: 0xe8c7b756 out range of signed 32bit displacement
> md5-x86_64.s:68: Error: 0xc1bdceee out range of signed 32bit displacement
> md5-x86_64.s:77: Error: 0xf57c0faf out range of signed 32bit displacement
> md5-x86_64.s:95: Error: 0xa8304613 out range of signed 32bit displacement
> md5-x86_64.s:104: Error: 0xfd469501 out range of signed 32bit displacement
> md5-x86_64.s:122: Error: 0x8b44f7af out range of signed 32bit displacement
> md5-x86_64.s:131: Error: 0xffff5bb1 out range of signed 32bit displacement
> md5-x86_64.s:140: Error: 0x895cd7be out range of signed 32bit displacement
> md5-x86_64.s:158: Error: 0xfd987193 out range of signed 32bit displacement
> md5-x86_64.s:167: Error: 0xa679438e out range of signed 32bit displacement
> md5-x86_64.s:187: Error: 0xf61e2562 out range of signed 32bit displacement
> md5-x86_64.s:196: Error: 0xc040b340 out range of signed 32bit displacement
> md5-x86_64.s:214: Error: 0xe9b6c7aa out range of signed 32bit displacement
> md5-x86_64.s:223: Error: 0xd62f105d out range of signed 32bit displacement
> md5-x86_64.s:241: Error: 0xd8a1e681 out range of signed 32bit displacement
> md5-x86_64.s:250: Error: 0xe7d3fbc8 out range of signed 32bit displacement
> md5-x86_64.s:268: Error: 0xc33707d6 out range of signed 32bit displacement
> md5-x86_64.s:277: Error: 0xf4d50d87 out range of signed 32bit displacement
> md5-x86_64.s:295: Error: 0xa9e3e905 out range of signed 32bit displacement
> md5-x86_64.s:304: Error: 0xfcefa3f8 out range of signed 32bit displacement
> md5-x86_64.s:322: Error: 0x8d2a4c8a out range of signed 32bit displacement
> md5-x86_64.s:332: Error: 0xfffa3942 out range of signed 32bit displacement
> md5-x86_64.s:340: Error: 0x8771f681 out range of signed 32bit displacement
> md5-x86_64.s:356: Error: 0xfde5380c out range of signed 32bit displacement
> md5-x86_64.s:364: Error: 0xa4beea44 out range of signed 32bit displacement
> md5-x86_64.s:380: Error: 0xf6bb4b60 out range of signed 32bit displacement
> md5-x86_64.s:388: Error: 0xbebfbc70 out range of signed 32bit displacement
> md5-x86_64.s:404: Error: 0xeaa127fa out range of signed 32bit displacement
> md5-x86_64.s:412: Error: 0xd4ef3085 out range of signed 32bit displacement
> md5-x86_64.s:428: Error: 0xd9d4d039 out range of signed 32bit displacement
> md5-x86_64.s:436: Error: 0xe6db99e5 out range of signed 32bit displacement
> md5-x86_64.s:452: Error: 0xc4ac5665 out range of signed 32bit displacement
> md5-x86_64.s:463: Error: 0xf4292244 out range of signed 32bit displacement
> md5-x86_64.s:481: Error: 0xab9423a7 out range of signed 32bit displacement
> md5-x86_64.s:490: Error: 0xfc93a039 out range of signed 32bit displacement
> md5-x86_64.s:508: Error: 0x8f0ccc92 out range of signed 32bit displacement
> md5-x86_64.s:517: Error: 0xffeff47d out range of signed 32bit displacement
> md5-x86_64.s:526: Error: 0x85845dd1 out range of signed 32bit displacement
> md5-x86_64.s:544: Error: 0xfe2ce6e0 out range of signed 32bit displacement
> md5-x86_64.s:553: Error: 0xa3014314 out range of signed 32bit displacement
> md5-x86_64.s:571: Error: 0xf7537e82 out range of signed 32bit displacement
> md5-x86_64.s:580: Error: 0xbd3af235 out range of signed 32bit displacement
> md5-x86_64.s:598: Error: 0xeb86d391 out range of signed 32bit displacement
> make[2]: *** [md5-x86_64.o] Error 1
>
> make[2]: Leaving directory `/home/whu/parsec/parsec-2.1/pkgs/libs/ssl/obj/amd64-linux.gcc/crypto/md5'
> make[1]: *** [subdirs] Error 1
>
> make[1]: Leaving directory `/home/whu/parsec/parsec-2.1/pkgs/libs/ssl/obj/amd64-linux.gcc/crypto'
> make: *** [build_crypto] Error 1
>
> [PARSEC] Error: 'env PATH=/usr/bin:/home/whu/parsec/parsec-2.1/bin/../bin:/usr/local/sbin:/usr/local/bin:/usr/sbin:/usr/bin:/sbin:/bin:/usr/games /usr/bin/make' failed.
>
> --------------------------------------------------------------------------------------
>
> BestWishes
>
> 2011-03-21
> ------------------------------
> Jasper
>
> _______________________________________________
> parsec-users mailing list
> parsec-users at lists.cs.princeton.edu
> https://lists.cs.princeton.edu/mailman/listinfo/parsec-users
>
>


-- 
--
Juan Carlos
-------------- next part --------------
An HTML attachment was scrubbed...
URL: <http://lists.cs.princeton.edu/pipermail/parsec-users/attachments/20110321/1324051e/attachment-0001.html>


More information about the parsec-users mailing list