[parsec-users] parsec-users Digest, Vol 56, Issue 16

Ardalan Pouya a.pouyabahar at gmail.com
Sat Sep 29 10:04:38 EDT 2012


thanks a lot dear Jm , you helped me so much :)

On Sat, Sep 29, 2012 at 5:31 PM, Juan Manuel Cebrián González <
jcebrian at ditec.um.es> wrote:

> Hi. You can try to build it manually as suggested here (
> http://abhishek-sagar.blogspot.no/2012/06/parsec-md5-x8664s41-error-0xd76aa478.html), it's the only thing that comes to my mind. The other commands I gave you
> worked for me with both parsec 2.1 and 3.0 on 3 different machines with GCC
> 4.7. Not sure where the problem is sorry :(.
>
> Jm.
>
> On Sat, Sep 29, 2012 at 2:19 PM, <
> parsec-users-request at lists.cs.princeton.edu> wrote:
>
>> Send parsec-users mailing list submissions to
>>         parsec-users at lists.cs.princeton.edu
>>
>> To subscribe or unsubscribe via the World Wide Web, visit
>>         https://lists.cs.princeton.edu/mailman/listinfo/parsec-users
>> or, via email, send a message with subject or body 'help' to
>>         parsec-users-request at lists.cs.princeton.edu
>>
>> You can reach the person managing the list at
>>         parsec-users-owner at lists.cs.princeton.edu
>>
>> When replying, please edit your Subject line so it is more specific
>> than "Re: Contents of parsec-users digest..."
>>
>> Today's Topics:
>>
>>    1. Re: parsec-users Digest, Vol 56, Issue 14 (Ardalan Pouya)
>>
>>
>> ---------- Forwarded message ----------
>> From: Ardalan Pouya <a.pouyabahar at gmail.com>
>> To: PARSEC Users <parsec-users at lists.cs.princeton.edu>
>> Cc:
>> Date: Sat, 29 Sep 2012 15:49:40 +0330
>> Subject: Re: [parsec-users] parsec-users Digest, Vol 56, Issue 14
>> yes I did exactly as you said and it gave this error (previous errors are
>> gone) :
>>
>> make: *** No rule to make target `config', needed by `Makefile'.  Stop.
>> [PARSEC] Running 'env
>> PATH=/usr/bin:/home/ardalan/Desktop/parsec/parsec-2.1/bin:/usr/lib/lightdm/lightdm:/usr/local/sbin:/usr/local/bin:/usr/sbin:/usr/bin:/sbin:/bin:/usr/games
>> /usr/bin/make':
>> make: *** No rule to make target `config', needed by `Makefile'.  Stop.
>> [PARSEC] Error: 'env
>> PATH=/usr/bin:/home/ardalan/Desktop/parsec/parsec-2.1/bin:/usr/lib/lightdm/lightdm:/usr/local/sbin:/usr/local/bin:/usr/sbin:/usr/bin:/sbin:/bin:/usr/games
>> /usr/bin/make' failed.
>>
>> On Sat, Sep 29, 2012 at 3:47 PM, Juan Manuel Cebrián González <
>> jcebrian at ditec.um.es> wrote:
>>
>>> Did you do this?
>>>
>>> mv openssl-1.0.1c/ src
>>> rm /src/Makefile
>>> mv /src/config /src/configure
>>>
>>> You need to remove the Makefile that comes with the new version and move
>>> the config file to "configure".
>>>
>>> Jm.
>>>
>>> On Sat, Sep 29, 2012 at 1:29 PM, <
>>> parsec-users-request at lists.cs.princeton.edu> wrote:
>>>
>>>> Send parsec-users mailing list submissions to
>>>>         parsec-users at lists.cs.princeton.edu
>>>>
>>>> To subscribe or unsubscribe via the World Wide Web, visit
>>>>         https://lists.cs.princeton.edu/mailman/listinfo/parsec-users
>>>> or, via email, send a message with subject or body 'help' to
>>>>         parsec-users-request at lists.cs.princeton.edu
>>>>
>>>> You can reach the person managing the list at
>>>>         parsec-users-owner at lists.cs.princeton.edu
>>>>
>>>> When replying, please edit your Subject line so it is more specific
>>>> than "Re: Contents of parsec-users digest..."
>>>>
>>>> Today's Topics:
>>>>
>>>>    1. Re: problem with building parsec (Ardalan Pouya)
>>>>    2. Re: problem with building parsec (Ardalan Pouya)
>>>>
>>>>
>>>> ---------- Forwarded message ----------
>>>> From: Ardalan Pouya <a.pouyabahar at gmail.com>
>>>> To: PARSEC Users <parsec-users at lists.cs.princeton.edu>
>>>> Cc:
>>>> Date: Sat, 29 Sep 2012 14:56:31 +0330
>>>> Subject: Re: [parsec-users] problem with building parsec
>>>> I updated the openssl src file to 1.0.1c and now it's getting this
>>>> error :
>>>>
>>>> make: *** No rule to make target `config', needed by `Makefile'.  Stop.
>>>> [PARSEC] Running 'env
>>>> PATH=/usr/bin:/home/ardalan/Desktop/parsec/parsec-2.1/bin:/usr/lib/lightdm/lightdm:/usr/local/sbin:/usr/local/bin:/usr/sbin:/usr/bin:/sbin:/bin:/usr/games
>>>> /usr/bin/make':
>>>> make: *** No rule to make target `config', needed by `Makefile'.  Stop.
>>>> [PARSEC] Error: 'env
>>>> PATH=/usr/bin:/home/ardalan/Desktop/parsec/parsec-2.1/bin:/usr/lib/lightdm/lightdm:/usr/local/sbin:/usr/local/bin:/usr/sbin:/usr/bin:/sbin:/bin:/usr/games
>>>> /usr/bin/make' failed.
>>>>
>>>>
>>>> On Thu, Sep 27, 2012 at 10:31 AM, Juan Cebrian <juanmc at idi.ntnu.no>wrote:
>>>>
>>>>>  You can also download a newer SSL version, this one works:
>>>>>
>>>>> Update SSL to version OpenSSL 1.0.1c
>>>>>
>>>>> cd pkgs/libs/ssl
>>>>> mv src src_old
>>>>> wget http://www.openssl.org/source/openssl-1.0.1c.tar.gz
>>>>> tar -xzvf openssl-1.0.1c.tar.gz
>>>>> openssl-1.0.1c/ src
>>>>> rm /src/Makefile
>>>>> mv /src/config /src/configure
>>>>>
>>>>> Jm.
>>>>>
>>>>>  ------------------------------
>>>>> *De:* Ardalan Pouya [a.pouyabahar at gmail.com]
>>>>> *Enviado el:* martes, 25 de septiembre de 2012 21:41
>>>>> *Para:* parsec-users at lists.cs.princeton.edu
>>>>> *Asunto:* [parsec-users] problem with building parsec
>>>>>
>>>>>  hi everyone ,
>>>>> please help me with this error , I dont know what to do ! I patched
>>>>> parsec files and again it has error pleaaaase help me :(
>>>>>
>>>>>  this is the error  :
>>>>>  gcc -I.. -I../.. -I../../include -DOPENSSL_THREADS -D_REENTRANT
>>>>> -DDSO_DLFCN -DHAVE_DLFCN_H -m64 -DL_ENDIAN -DTERMIO -O3 -Wall
>>>>> -DMD32_REG_T=int -DOPENSSL_BN_ASM_MONT -DSHA1_ASM -DSHA256_ASM -DSHA512_ASM
>>>>> -DMD5_ASM -DAES_ASM -c  -o md5-x86_64.o md5-x86_64.s
>>>>> md5-x86_64.s: Assembler messages:
>>>>> md5-x86_64.s:41: Error: 0xd76aa478 out range of signed 32bit
>>>>> displacement
>>>>> md5-x86_64.s:50: Error: 0xe8c7b756 out range of signed 32bit
>>>>> displacement
>>>>> md5-x86_64.s:68: Error: 0xc1bdceee out range of signed 32bit
>>>>> displacement
>>>>> md5-x86_64.s:77: Error: 0xf57c0faf out range of signed 32bit
>>>>> displacement
>>>>> md5-x86_64.s:95: Error: 0xa8304613 out range of signed 32bit
>>>>> displacement
>>>>> md5-x86_64.s:104: Error: 0xfd469501 out range of signed 32bit
>>>>> displacement
>>>>> md5-x86_64.s:122: Error: 0x8b44f7af out range of signed 32bit
>>>>> displacement
>>>>> md5-x86_64.s:131: Error: 0xffff5bb1 out range of signed 32bit
>>>>> displacement
>>>>> md5-x86_64.s:140: Error: 0x895cd7be out range of signed 32bit
>>>>> displacement
>>>>> md5-x86_64.s:158: Error: 0xfd987193 out range of signed 32bit
>>>>> displacement
>>>>> md5-x86_64.s:167: Error: 0xa679438e out range of signed 32bit
>>>>> displacement
>>>>> md5-x86_64.s:187: Error: 0xf61e2562 out range of signed 32bit
>>>>> displacement
>>>>> md5-x86_64.s:196: Error: 0xc040b340 out range of signed 32bit
>>>>> displacement
>>>>> md5-x86_64.s:214: Error: 0xe9b6c7aa out range of signed 32bit
>>>>> displacement
>>>>> md5-x86_64.s:223: Error: 0xd62f105d out range of signed 32bit
>>>>> displacement
>>>>> md5-x86_64.s:241: Error: 0xd8a1e681 out range of signed 32bit
>>>>> displacement
>>>>> md5-x86_64.s:250: Error: 0xe7d3fbc8 out range of signed 32bit
>>>>> displacement
>>>>> md5-x86_64.s:268: Error: 0xc33707d6 out range of signed 32bit
>>>>> displacement
>>>>> md5-x86_64.s:277: Error: 0xf4d50d87 out range of signed 32bit
>>>>> displacement
>>>>> md5-x86_64.s:295: Error: 0xa9e3e905 out range of signed 32bit
>>>>> displacement
>>>>> md5-x86_64.s:304: Error: 0xfcefa3f8 out range of signed 32bit
>>>>> displacement
>>>>> md5-x86_64.s:322: Error: 0x8d2a4c8a out range of signed 32bit
>>>>> displacement
>>>>> md5-x86_64.s:332: Error: 0xfffa3942 out range of signed 32bit
>>>>> displacement
>>>>> md5-x86_64.s:340: Error: 0x8771f681 out range of signed 32bit
>>>>> displacement
>>>>> md5-x86_64.s:356: Error: 0xfde5380c out range of signed 32bit
>>>>> displacement
>>>>> md5-x86_64.s:364: Error: 0xa4beea44 out range of signed 32bit
>>>>> displacement
>>>>> md5-x86_64.s:380: Error: 0xf6bb4b60 out range of signed 32bit
>>>>> displacement
>>>>> md5-x86_64.s:388: Error: 0xbebfbc70 out range of signed 32bit
>>>>> displacement
>>>>> md5-x86_64.s:404: Error: 0xeaa127fa out range of signed 32bit
>>>>> displacement
>>>>> md5-x86_64.s:412: Error: 0xd4ef3085 out range of signed 32bit
>>>>> displacement
>>>>> md5-x86_64.s:428: Error: 0xd9d4d039 out range of signed 32bit
>>>>> displacement
>>>>> md5-x86_64.s:436: Error: 0xe6db99e5 out range of signed 32bit
>>>>> displacement
>>>>> md5-x86_64.s:452: Error: 0xc4ac5665 out range of signed 32bit
>>>>> displacement
>>>>> md5-x86_64.s:463: Error: 0xf4292244 out range of signed 32bit
>>>>> displacement
>>>>> md5-x86_64.s:481: Error: 0xab9423a7 out range of signed 32bit
>>>>> displacement
>>>>> md5-x86_64.s:490: Error: 0xfc93a039 out range of signed 32bit
>>>>> displacement
>>>>> md5-x86_64.s:508: Error: 0x8f0ccc92 out range of signed 32bit
>>>>> displacement
>>>>> md5-x86_64.s:517: Error: 0xffeff47d out range of signed 32bit
>>>>> displacement
>>>>> md5-x86_64.s:526: Error: 0x85845dd1 out range of signed 32bit
>>>>> displacement
>>>>> md5-x86_64.s:544: Error: 0xfe2ce6e0 out range of signed 32bit
>>>>> displacement
>>>>> md5-x86_64.s:553: Error: 0xa3014314 out range of signed 32bit
>>>>> displacement
>>>>> md5-x86_64.s:571: Error: 0xf7537e82 out range of signed 32bit
>>>>> displacement
>>>>> md5-x86_64.s:580: Error: 0xbd3af235 out range of signed 32bit
>>>>> displacement
>>>>> md5-x86_64.s:598: Error: 0xeb86d391 out range of signed 32bit
>>>>> displacement
>>>>> make[2]: *** [md5-x86_64.o] Error 1
>>>>> make[2]: Leaving directory
>>>>> `/home/ardalan/Desktop/parsec/parsec-2.1/pkgs/libs/ssl/obj/amd64-linux.gcc/crypto/md5'
>>>>> make[1]: *** [subdirs] Error 1
>>>>> make[1]: Leaving directory
>>>>> `/home/ardalan/Desktop/parsec/parsec-2.1/pkgs/libs/ssl/obj/amd64-linux.gcc/crypto'
>>>>> make: *** [build_crypto] Error 1
>>>>> [PARSEC] Error: 'env
>>>>> PATH=/usr/bin:/home/ardalan/Desktop/parsec/parsec-2.1/bin:/usr/local/sbin:/usr/local/bin:/usr/sbin:/usr/bin:/sbin:/bin:/usr/games
>>>>> /usr/bin/make' failed.
>>>>>
>>>>> _______________________________________________
>>>>> parsec-users mailing list
>>>>> parsec-users at lists.cs.princeton.edu
>>>>> https://lists.cs.princeton.edu/mailman/listinfo/parsec-users
>>>>>
>>>>>
>>>>
>>>>
>>>> ---------- Forwarded message ----------
>>>> From: Ardalan Pouya <a.pouyabahar at gmail.com>
>>>> To: PARSEC Users <parsec-users at lists.cs.princeton.edu>
>>>> Cc:
>>>> Date: Sat, 29 Sep 2012 14:59:36 +0330
>>>> Subject: Re: [parsec-users] problem with building parsec
>>>> thanks for your reply ,
>>>> No but I did it now and rebuild it again same error .
>>>> yes both files exist :
>>>> line 41 of md5-x86_64.s is :
>>>>
>>>> leal 3614090360(%rax,%r10,1),%eax
>>>>
>>>> -----------------------
>>>> line 19-24 "./pkgs/libs/ssl/obj/amd64-**linux.gcc/crypto/md5/asm/md5-**
>>>> x86_64.pl <http://md5-x86_64.pl/>" is :
>>>>
>>>> sub round1_step
>>>> {
>>>>     my ($pos, $dst, $x, $y, $z, $k_next, $T_i, $s) = @_;
>>>>     $code .= " mov 0*4(%rsi), %r10d /* (NEXT STEP) X[0] */\n" if ($pos
>>>> == -1);
>>>>     $code .= " mov %edx, %r11d /* (NEXT STEP) z' = %edx */\n" if ($pos
>>>> == -1);
>>>>     $code .= <<EOF;
>>>>
>>>> -----------------
>>>>
>>>> On Sat, Sep 29, 2012 at 2:56 PM, Ardalan Pouya <a.pouyabahar at gmail.com>wrote:
>>>>
>>>>> I updated the openssl src file to 1.0.1c and now it's getting this
>>>>> error :
>>>>>
>>>>> make: *** No rule to make target `config', needed by `Makefile'.  Stop.
>>>>> [PARSEC] Running 'env
>>>>> PATH=/usr/bin:/home/ardalan/Desktop/parsec/parsec-2.1/bin:/usr/lib/lightdm/lightdm:/usr/local/sbin:/usr/local/bin:/usr/sbin:/usr/bin:/sbin:/bin:/usr/games
>>>>> /usr/bin/make':
>>>>> make: *** No rule to make target `config', needed by `Makefile'.  Stop.
>>>>> [PARSEC] Error: 'env
>>>>> PATH=/usr/bin:/home/ardalan/Desktop/parsec/parsec-2.1/bin:/usr/lib/lightdm/lightdm:/usr/local/sbin:/usr/local/bin:/usr/sbin:/usr/bin:/sbin:/bin:/usr/games
>>>>> /usr/bin/make' failed.
>>>>>
>>>>>
>>>>> On Thu, Sep 27, 2012 at 10:31 AM, Juan Cebrian <juanmc at idi.ntnu.no>wrote:
>>>>>
>>>>>>  You can also download a newer SSL version, this one works:
>>>>>>
>>>>>> Update SSL to version OpenSSL 1.0.1c
>>>>>>
>>>>>> cd pkgs/libs/ssl
>>>>>> mv src src_old
>>>>>> wget http://www.openssl.org/source/openssl-1.0.1c.tar.gz
>>>>>> tar -xzvf openssl-1.0.1c.tar.gz
>>>>>> openssl-1.0.1c/ src
>>>>>> rm /src/Makefile
>>>>>> mv /src/config /src/configure
>>>>>>
>>>>>> Jm.
>>>>>>
>>>>>>  ------------------------------
>>>>>> *De:* Ardalan Pouya [a.pouyabahar at gmail.com]
>>>>>> *Enviado el:* martes, 25 de septiembre de 2012 21:41
>>>>>> *Para:* parsec-users at lists.cs.princeton.edu
>>>>>> *Asunto:* [parsec-users] problem with building parsec
>>>>>>
>>>>>>  hi everyone ,
>>>>>> please help me with this error , I dont know what to do ! I patched
>>>>>> parsec files and again it has error pleaaaase help me :(
>>>>>>
>>>>>>  this is the error  :
>>>>>>  gcc -I.. -I../.. -I../../include -DOPENSSL_THREADS -D_REENTRANT
>>>>>> -DDSO_DLFCN -DHAVE_DLFCN_H -m64 -DL_ENDIAN -DTERMIO -O3 -Wall
>>>>>> -DMD32_REG_T=int -DOPENSSL_BN_ASM_MONT -DSHA1_ASM -DSHA256_ASM -DSHA512_ASM
>>>>>> -DMD5_ASM -DAES_ASM -c  -o md5-x86_64.o md5-x86_64.s
>>>>>> md5-x86_64.s: Assembler messages:
>>>>>> md5-x86_64.s:41: Error: 0xd76aa478 out range of signed 32bit
>>>>>> displacement
>>>>>> md5-x86_64.s:50: Error: 0xe8c7b756 out range of signed 32bit
>>>>>> displacement
>>>>>> md5-x86_64.s:68: Error: 0xc1bdceee out range of signed 32bit
>>>>>> displacement
>>>>>> md5-x86_64.s:77: Error: 0xf57c0faf out range of signed 32bit
>>>>>> displacement
>>>>>> md5-x86_64.s:95: Error: 0xa8304613 out range of signed 32bit
>>>>>> displacement
>>>>>> md5-x86_64.s:104: Error: 0xfd469501 out range of signed 32bit
>>>>>> displacement
>>>>>> md5-x86_64.s:122: Error: 0x8b44f7af out range of signed 32bit
>>>>>> displacement
>>>>>> md5-x86_64.s:131: Error: 0xffff5bb1 out range of signed 32bit
>>>>>> displacement
>>>>>> md5-x86_64.s:140: Error: 0x895cd7be out range of signed 32bit
>>>>>> displacement
>>>>>> md5-x86_64.s:158: Error: 0xfd987193 out range of signed 32bit
>>>>>> displacement
>>>>>> md5-x86_64.s:167: Error: 0xa679438e out range of signed 32bit
>>>>>> displacement
>>>>>> md5-x86_64.s:187: Error: 0xf61e2562 out range of signed 32bit
>>>>>> displacement
>>>>>> md5-x86_64.s:196: Error: 0xc040b340 out range of signed 32bit
>>>>>> displacement
>>>>>> md5-x86_64.s:214: Error: 0xe9b6c7aa out range of signed 32bit
>>>>>> displacement
>>>>>> md5-x86_64.s:223: Error: 0xd62f105d out range of signed 32bit
>>>>>> displacement
>>>>>> md5-x86_64.s:241: Error: 0xd8a1e681 out range of signed 32bit
>>>>>> displacement
>>>>>> md5-x86_64.s:250: Error: 0xe7d3fbc8 out range of signed 32bit
>>>>>> displacement
>>>>>> md5-x86_64.s:268: Error: 0xc33707d6 out range of signed 32bit
>>>>>> displacement
>>>>>> md5-x86_64.s:277: Error: 0xf4d50d87 out range of signed 32bit
>>>>>> displacement
>>>>>> md5-x86_64.s:295: Error: 0xa9e3e905 out range of signed 32bit
>>>>>> displacement
>>>>>> md5-x86_64.s:304: Error: 0xfcefa3f8 out range of signed 32bit
>>>>>> displacement
>>>>>> md5-x86_64.s:322: Error: 0x8d2a4c8a out range of signed 32bit
>>>>>> displacement
>>>>>> md5-x86_64.s:332: Error: 0xfffa3942 out range of signed 32bit
>>>>>> displacement
>>>>>> md5-x86_64.s:340: Error: 0x8771f681 out range of signed 32bit
>>>>>> displacement
>>>>>> md5-x86_64.s:356: Error: 0xfde5380c out range of signed 32bit
>>>>>> displacement
>>>>>> md5-x86_64.s:364: Error: 0xa4beea44 out range of signed 32bit
>>>>>> displacement
>>>>>> md5-x86_64.s:380: Error: 0xf6bb4b60 out range of signed 32bit
>>>>>> displacement
>>>>>> md5-x86_64.s:388: Error: 0xbebfbc70 out range of signed 32bit
>>>>>> displacement
>>>>>> md5-x86_64.s:404: Error: 0xeaa127fa out range of signed 32bit
>>>>>> displacement
>>>>>> md5-x86_64.s:412: Error: 0xd4ef3085 out range of signed 32bit
>>>>>> displacement
>>>>>> md5-x86_64.s:428: Error: 0xd9d4d039 out range of signed 32bit
>>>>>> displacement
>>>>>> md5-x86_64.s:436: Error: 0xe6db99e5 out range of signed 32bit
>>>>>> displacement
>>>>>> md5-x86_64.s:452: Error: 0xc4ac5665 out range of signed 32bit
>>>>>> displacement
>>>>>> md5-x86_64.s:463: Error: 0xf4292244 out range of signed 32bit
>>>>>> displacement
>>>>>> md5-x86_64.s:481: Error: 0xab9423a7 out range of signed 32bit
>>>>>> displacement
>>>>>> md5-x86_64.s:490: Error: 0xfc93a039 out range of signed 32bit
>>>>>> displacement
>>>>>> md5-x86_64.s:508: Error: 0x8f0ccc92 out range of signed 32bit
>>>>>> displacement
>>>>>> md5-x86_64.s:517: Error: 0xffeff47d out range of signed 32bit
>>>>>> displacement
>>>>>> md5-x86_64.s:526: Error: 0x85845dd1 out range of signed 32bit
>>>>>> displacement
>>>>>> md5-x86_64.s:544: Error: 0xfe2ce6e0 out range of signed 32bit
>>>>>> displacement
>>>>>> md5-x86_64.s:553: Error: 0xa3014314 out range of signed 32bit
>>>>>> displacement
>>>>>> md5-x86_64.s:571: Error: 0xf7537e82 out range of signed 32bit
>>>>>> displacement
>>>>>> md5-x86_64.s:580: Error: 0xbd3af235 out range of signed 32bit
>>>>>> displacement
>>>>>> md5-x86_64.s:598: Error: 0xeb86d391 out range of signed 32bit
>>>>>> displacement
>>>>>> make[2]: *** [md5-x86_64.o] Error 1
>>>>>> make[2]: Leaving directory
>>>>>> `/home/ardalan/Desktop/parsec/parsec-2.1/pkgs/libs/ssl/obj/amd64-linux.gcc/crypto/md5'
>>>>>> make[1]: *** [subdirs] Error 1
>>>>>> make[1]: Leaving directory
>>>>>> `/home/ardalan/Desktop/parsec/parsec-2.1/pkgs/libs/ssl/obj/amd64-linux.gcc/crypto'
>>>>>> make: *** [build_crypto] Error 1
>>>>>> [PARSEC] Error: 'env
>>>>>> PATH=/usr/bin:/home/ardalan/Desktop/parsec/parsec-2.1/bin:/usr/local/sbin:/usr/local/bin:/usr/sbin:/usr/bin:/sbin:/bin:/usr/games
>>>>>> /usr/bin/make' failed.
>>>>>>
>>>>>> _______________________________________________
>>>>>> parsec-users mailing list
>>>>>> parsec-users at lists.cs.princeton.edu
>>>>>> https://lists.cs.princeton.edu/mailman/listinfo/parsec-users
>>>>>>
>>>>>>
>>>>>
>>>>
>>>> _______________________________________________
>>>> parsec-users mailing list
>>>> parsec-users at lists.cs.princeton.edu
>>>> https://lists.cs.princeton.edu/mailman/listinfo/parsec-users
>>>>
>>>>
>>>
>>>
>>> --
>>> ---------------------------------------------
>>> Juan Manuel Cebrián González
>>> University of Murcia, Spain
>>> http://skywalker.inf.um.es/~jcebrian/
>>> ---------------------------------------------
>>>
>>>
>>> _______________________________________________
>>> parsec-users mailing list
>>> parsec-users at lists.cs.princeton.edu
>>> https://lists.cs.princeton.edu/mailman/listinfo/parsec-users
>>>
>>>
>>
>> _______________________________________________
>> parsec-users mailing list
>> parsec-users at lists.cs.princeton.edu
>> https://lists.cs.princeton.edu/mailman/listinfo/parsec-users
>>
>>
>
>
> --
> ---------------------------------------------
> Juan Manuel Cebrián González
> University of Murcia, Spain
> http://skywalker.inf.um.es/~jcebrian/
> ---------------------------------------------
>
>
> _______________________________________________
> parsec-users mailing list
> parsec-users at lists.cs.princeton.edu
> https://lists.cs.princeton.edu/mailman/listinfo/parsec-users
>
>
-------------- next part --------------
An HTML attachment was scrubbed...
URL: <http://lists.cs.princeton.edu/pipermail/parsec-users/attachments/20120929/5cb6b60e/attachment.html>


More information about the parsec-users mailing list