[parsec-users] problem with building parsec

Joseph Greathouse jlgreath at umich.edu
Sun Sep 30 14:35:53 EDT 2012


I'm not sure exactly what you're patching, but the files you've shown tell
me that you are still attempting to compile a non-patched version of
OpenSSL.

Please try completely removing the directory ./pkgs/libs/ssl/obj/ and
patching the files ./pkgs/libs/ssl/src/crypto/md5/asm/md5-x86_64.pl and
./pkgs/libs/ssl/src/crypto/sha/asm/sha1-x86_64.pl with the changes shown in
the patch I previously linked. Then try recompiling dedup.

-Joe

On Sat, Sep 29, 2012 at 6:29 AM, Ardalan Pouya <a.pouyabahar at gmail.com>wrote:

> thanks for your reply ,
> No but I did it now and rebuild it again same error .
> yes both files exist :
> line 41 of md5-x86_64.s is :
>
> leal 3614090360(%rax,%r10,1),%eax
>
> -----------------------
> line 19-24 "./pkgs/libs/ssl/obj/amd64-**linux.gcc/crypto/md5/asm/md5-**
> x86_64.pl <http://md5-x86_64.pl/>" is :
>
> sub round1_step
> {
>     my ($pos, $dst, $x, $y, $z, $k_next, $T_i, $s) = @_;
>     $code .= " mov 0*4(%rsi), %r10d /* (NEXT STEP) X[0] */\n" if ($pos ==
> -1);
>     $code .= " mov %edx, %r11d /* (NEXT STEP) z' = %edx */\n" if ($pos ==
> -1);
>     $code .= <<EOF;
>
> -----------------
>
> On Sat, Sep 29, 2012 at 2:56 PM, Ardalan Pouya <a.pouyabahar at gmail.com>wrote:
>
>> I updated the openssl src file to 1.0.1c and now it's getting this error
>> :
>>
>> make: *** No rule to make target `config', needed by `Makefile'.  Stop.
>> [PARSEC] Running 'env
>> PATH=/usr/bin:/home/ardalan/Desktop/parsec/parsec-2.1/bin:/usr/lib/lightdm/lightdm:/usr/local/sbin:/usr/local/bin:/usr/sbin:/usr/bin:/sbin:/bin:/usr/games
>> /usr/bin/make':
>> make: *** No rule to make target `config', needed by `Makefile'.  Stop.
>> [PARSEC] Error: 'env
>> PATH=/usr/bin:/home/ardalan/Desktop/parsec/parsec-2.1/bin:/usr/lib/lightdm/lightdm:/usr/local/sbin:/usr/local/bin:/usr/sbin:/usr/bin:/sbin:/bin:/usr/games
>> /usr/bin/make' failed.
>>
>>
>> On Thu, Sep 27, 2012 at 10:31 AM, Juan Cebrian <juanmc at idi.ntnu.no>wrote:
>>
>>>  You can also download a newer SSL version, this one works:
>>>
>>> Update SSL to version OpenSSL 1.0.1c
>>>
>>> cd pkgs/libs/ssl
>>> mv src src_old
>>> wget http://www.openssl.org/source/openssl-1.0.1c.tar.gz
>>> tar -xzvf openssl-1.0.1c.tar.gz
>>> openssl-1.0.1c/ src
>>> rm /src/Makefile
>>> mv /src/config /src/configure
>>>
>>> Jm.
>>>
>>>  ------------------------------
>>> *De:* Ardalan Pouya [a.pouyabahar at gmail.com]
>>> *Enviado el:* martes, 25 de septiembre de 2012 21:41
>>> *Para:* parsec-users at lists.cs.princeton.edu
>>> *Asunto:* [parsec-users] problem with building parsec
>>>
>>>  hi everyone ,
>>> please help me with this error , I dont know what to do ! I patched
>>> parsec files and again it has error pleaaaase help me :(
>>>
>>>  this is the error  :
>>>  gcc -I.. -I../.. -I../../include -DOPENSSL_THREADS -D_REENTRANT
>>> -DDSO_DLFCN -DHAVE_DLFCN_H -m64 -DL_ENDIAN -DTERMIO -O3 -Wall
>>> -DMD32_REG_T=int -DOPENSSL_BN_ASM_MONT -DSHA1_ASM -DSHA256_ASM -DSHA512_ASM
>>> -DMD5_ASM -DAES_ASM -c  -o md5-x86_64.o md5-x86_64.s
>>> md5-x86_64.s: Assembler messages:
>>> md5-x86_64.s:41: Error: 0xd76aa478 out range of signed 32bit displacement
>>> md5-x86_64.s:50: Error: 0xe8c7b756 out range of signed 32bit displacement
>>> md5-x86_64.s:68: Error: 0xc1bdceee out range of signed 32bit displacement
>>> md5-x86_64.s:77: Error: 0xf57c0faf out range of signed 32bit displacement
>>> md5-x86_64.s:95: Error: 0xa8304613 out range of signed 32bit displacement
>>> md5-x86_64.s:104: Error: 0xfd469501 out range of signed 32bit
>>> displacement
>>> md5-x86_64.s:122: Error: 0x8b44f7af out range of signed 32bit
>>> displacement
>>> md5-x86_64.s:131: Error: 0xffff5bb1 out range of signed 32bit
>>> displacement
>>> md5-x86_64.s:140: Error: 0x895cd7be out range of signed 32bit
>>> displacement
>>> md5-x86_64.s:158: Error: 0xfd987193 out range of signed 32bit
>>> displacement
>>> md5-x86_64.s:167: Error: 0xa679438e out range of signed 32bit
>>> displacement
>>> md5-x86_64.s:187: Error: 0xf61e2562 out range of signed 32bit
>>> displacement
>>> md5-x86_64.s:196: Error: 0xc040b340 out range of signed 32bit
>>> displacement
>>> md5-x86_64.s:214: Error: 0xe9b6c7aa out range of signed 32bit
>>> displacement
>>> md5-x86_64.s:223: Error: 0xd62f105d out range of signed 32bit
>>> displacement
>>> md5-x86_64.s:241: Error: 0xd8a1e681 out range of signed 32bit
>>> displacement
>>> md5-x86_64.s:250: Error: 0xe7d3fbc8 out range of signed 32bit
>>> displacement
>>> md5-x86_64.s:268: Error: 0xc33707d6 out range of signed 32bit
>>> displacement
>>> md5-x86_64.s:277: Error: 0xf4d50d87 out range of signed 32bit
>>> displacement
>>> md5-x86_64.s:295: Error: 0xa9e3e905 out range of signed 32bit
>>> displacement
>>> md5-x86_64.s:304: Error: 0xfcefa3f8 out range of signed 32bit
>>> displacement
>>> md5-x86_64.s:322: Error: 0x8d2a4c8a out range of signed 32bit
>>> displacement
>>> md5-x86_64.s:332: Error: 0xfffa3942 out range of signed 32bit
>>> displacement
>>> md5-x86_64.s:340: Error: 0x8771f681 out range of signed 32bit
>>> displacement
>>> md5-x86_64.s:356: Error: 0xfde5380c out range of signed 32bit
>>> displacement
>>> md5-x86_64.s:364: Error: 0xa4beea44 out range of signed 32bit
>>> displacement
>>> md5-x86_64.s:380: Error: 0xf6bb4b60 out range of signed 32bit
>>> displacement
>>> md5-x86_64.s:388: Error: 0xbebfbc70 out range of signed 32bit
>>> displacement
>>> md5-x86_64.s:404: Error: 0xeaa127fa out range of signed 32bit
>>> displacement
>>> md5-x86_64.s:412: Error: 0xd4ef3085 out range of signed 32bit
>>> displacement
>>> md5-x86_64.s:428: Error: 0xd9d4d039 out range of signed 32bit
>>> displacement
>>> md5-x86_64.s:436: Error: 0xe6db99e5 out range of signed 32bit
>>> displacement
>>> md5-x86_64.s:452: Error: 0xc4ac5665 out range of signed 32bit
>>> displacement
>>> md5-x86_64.s:463: Error: 0xf4292244 out range of signed 32bit
>>> displacement
>>> md5-x86_64.s:481: Error: 0xab9423a7 out range of signed 32bit
>>> displacement
>>> md5-x86_64.s:490: Error: 0xfc93a039 out range of signed 32bit
>>> displacement
>>> md5-x86_64.s:508: Error: 0x8f0ccc92 out range of signed 32bit
>>> displacement
>>> md5-x86_64.s:517: Error: 0xffeff47d out range of signed 32bit
>>> displacement
>>> md5-x86_64.s:526: Error: 0x85845dd1 out range of signed 32bit
>>> displacement
>>> md5-x86_64.s:544: Error: 0xfe2ce6e0 out range of signed 32bit
>>> displacement
>>> md5-x86_64.s:553: Error: 0xa3014314 out range of signed 32bit
>>> displacement
>>> md5-x86_64.s:571: Error: 0xf7537e82 out range of signed 32bit
>>> displacement
>>> md5-x86_64.s:580: Error: 0xbd3af235 out range of signed 32bit
>>> displacement
>>> md5-x86_64.s:598: Error: 0xeb86d391 out range of signed 32bit
>>> displacement
>>> make[2]: *** [md5-x86_64.o] Error 1
>>> make[2]: Leaving directory
>>> `/home/ardalan/Desktop/parsec/parsec-2.1/pkgs/libs/ssl/obj/amd64-linux.gcc/crypto/md5'
>>> make[1]: *** [subdirs] Error 1
>>> make[1]: Leaving directory
>>> `/home/ardalan/Desktop/parsec/parsec-2.1/pkgs/libs/ssl/obj/amd64-linux.gcc/crypto'
>>> make: *** [build_crypto] Error 1
>>> [PARSEC] Error: 'env
>>> PATH=/usr/bin:/home/ardalan/Desktop/parsec/parsec-2.1/bin:/usr/local/sbin:/usr/local/bin:/usr/sbin:/usr/bin:/sbin:/bin:/usr/games
>>> /usr/bin/make' failed.
>>>
>>> _______________________________________________
>>> parsec-users mailing list
>>> parsec-users at lists.cs.princeton.edu
>>> https://lists.cs.princeton.edu/mailman/listinfo/parsec-users
>>>
>>>
>>
>
> _______________________________________________
> parsec-users mailing list
> parsec-users at lists.cs.princeton.edu
> https://lists.cs.princeton.edu/mailman/listinfo/parsec-users
>
>
-------------- next part --------------
An HTML attachment was scrubbed...
URL: <http://lists.cs.princeton.edu/pipermail/parsec-users/attachments/20120930/8bc01bf3/attachment.html>


More information about the parsec-users mailing list