[parsec-users] compiling raytrace error

Adel Ejjeh (Student) aje02 at mail.aub.edu
Fri Jun 13 11:55:42 EDT 2014


Hello All

I am trying to build PARSEC 2.1 on my Ubuntu machine. When it reaches the raytrace benchmark it gives me this error:
(Keep in mind that I added -lXext to the LFLAGS and I also applied the patch “raytrace-unistd-gcc-fix.patch”)

[PARSEC] [========== Building package raytrace ==========]
[PARSEC] [---------- Analyzing package raytrace ----------]
[PARSEC] raytrace depends on: cmake mesa
[PARSEC] [---------- Analyzing package cmake ----------]
[PARSEC] Package cmake already exists, proceeding.
[PARSEC] [---------- Analyzing package mesa ----------]
[PARSEC] Package mesa already exists, proceeding.
[PARSEC] [---------- Building package raytrace ----------]
[PARSEC] Removing old build directory.
[PARSEC] Copying source code of package raytrace.
[PARSEC] Running 'env CXXFLAGS=-I/home/adel/parsec-2.1/bin/../pkgs/libs/mesa/inst/amd64-linux.gcc-serial/include -O3 -funroll-loops -fprefetch-loop-arrays -fpermissive -fno-exceptions -static-libgcc -Wl,--hash-style=both,--as-needed -DPARSEC_VERSION=2.1 -fexceptions -fno-strict-aliasing -fno-align-labels -DNDEBUG -D_MM_NO_ALIGN_CHECK LDFLAGS=-L/home/adel/parsec-2.1/bin/../pkgs/libs/mesa/inst/amd64-linux.gcc-serial/lib -lXext -L/usr/lib64 -L/usr/lib LIBS= -lXext -lXmu -lX11 -lGL -lGLU -lpthread ./configure --prefix=/home/adel/parsec-2.1/bin/../pkgs/apps/raytrace/inst/amd64-linux.gcc-serial':
Warning: Ignoring specified arguments
-- The C compiler identification is GNU
-- The CXX compiler identification is GNU
-- Check for working C compiler: /usr/bin/gcc
-- Check for working C compiler: /usr/bin/gcc -- works
-- Detecting C compiler ABI info
-- Detecting C compiler ABI info - done
-- Check for working CXX compiler: /usr/bin/g++
-- Check for working CXX compiler: /usr/bin/g++ -- works
-- Detecting CXX compiler ABI info
-- Detecting CXX compiler ABI info - done
-- Looking for include files CMAKE_HAVE_PTHREAD_H
-- Looking for include files CMAKE_HAVE_PTHREAD_H - found
-- Looking for pthread_create in pthreads
-- Looking for pthread_create in pthreads - not found
-- Looking for pthread_create in pthread
-- Looking for pthread_create in pthread - found
-- Configuring done
CMake Warning (dev) at CMakeLists.txt:153 (ADD_EXECUTABLE):
  Policy CMP0004 is not set: Libraries linked may not have leading or
  trailing whitespace.  Run "cmake --help-policy CMP0004" for policy details.
  Use the cmake_policy command to set the policy and suppress this warning.

  Target "test_glut" links to item " -lXext -lXmu -lX11 -lGL -lGLU -lpthread"
  which has leading or trailing whitespace.
This warning is for project developers.  Use -Wno-dev to suppress it.

CMake Warning (dev) at CMakeLists.txt:153 (ADD_EXECUTABLE):
  Policy CMP0003 should be set before this line.  Add code such as

    if(COMMAND cmake_policy)
      cmake_policy(SET CMP0003 NEW)
    endif(COMMAND cmake_policy)

  as early as possible but after the most recent call to
  cmake_minimum_required or cmake_policy(VERSION).  This warning appears
  because target "test_glut" links to some libraries for which the linker
  must search:

    -lXext -lXmu -lX11 -lGL -lGLU -lpthread

  and other libraries with known full path:

    /home/adel/parsec-2.1/pkgs/libs/mesa/inst/amd64-linux.gcc-serial/lib/libglut.a

  CMake is adding directories in the second list to the linker search path in
  case they are needed to find libraries from the first list (for backwards
  compatibility with CMake 2.4).  Set policy CMP0003 to OLD or NEW to enable
  or disable this behavior explicitly.  Run "cmake --help-policy CMP0003" for
  more information.
This warning is for project developers.  Use -Wno-dev to suppress it.

CMake Warning (dev) at LRT/CMakeLists.txt:19 (ADD_EXECUTABLE):
  Policy CMP0004 is not set: Libraries linked may not have leading or
  trailing whitespace.  Run "cmake --help-policy CMP0004" for policy details.
  Use the cmake_policy command to set the policy and suppress this warning.

  Target "test_static_cube" links to item " -lXext -lXmu -lX11 -lGL -lGLU
  -lpthread" which has leading or trailing whitespace.
This warning is for project developers.  Use -Wno-dev to suppress it.

CMake Warning (dev) at MiniView/CMakeLists.txt:1 (ADD_EXECUTABLE):
  Policy CMP0004 is not set: Libraries linked may not have leading or
  trailing whitespace.  Run "cmake --help-policy CMP0004" for policy details.
  Use the cmake_policy command to set the policy and suppress this warning.

  Target "rtview" links to item " -lXext -lXmu -lX11 -lGL -lGLU -lpthread"
  which has leading or trailing whitespace.
This warning is for project developers.  Use -Wno-dev to suppress it.

CMake Warning (dev) at MiniView/CMakeLists.txt:1 (ADD_EXECUTABLE):
  Policy CMP0004 is not set: Libraries linked may not have leading or
  trailing whitespace.  Run "cmake --help-policy CMP0004" for policy details.
  Use the cmake_policy command to set the policy and suppress this warning.

  Target "rtview" links to item " -lXext -lXmu -lX11 -lGL -lGLU -lpthread"
  which has leading or trailing whitespace.
This warning is for project developers.  Use -Wno-dev to suppress it.

-- Generating done
-- Build files have been written to: /home/adel/parsec-2.1/pkgs/apps/raytrace/obj/amd64-linux.gcc-serial
[PARSEC] Running 'env CXXFLAGS=-I/home/adel/parsec-2.1/bin/../pkgs/libs/mesa/inst/amd64-linux.gcc-serial/include -O3 -funroll-loops -fprefetch-loop-arrays -fpermissive -fno-exceptions -static-libgcc -Wl,--hash-style=both,--as-needed -DPARSEC_VERSION=2.1 -fexceptions -fno-strict-aliasing -fno-align-labels -DNDEBUG -D_MM_NO_ALIGN_CHECK LDFLAGS=-L/home/adel/parsec-2.1/bin/../pkgs/libs/mesa/inst/amd64-linux.gcc-serial/lib -lXext -L/usr/lib64 -L/usr/lib LIBS= -lXext -lXmu -lX11 -lGL -lGLU -lpthread /usr/bin/make':
/home/adel/parsec-2.1/pkgs/tools/cmake/inst/amd64-linux.gcc-serial/bin/cmake -H/home/adel/parsec-2.1/pkgs/apps/raytrace/obj/amd64-linux.gcc-serial -B/home/adel/parsec-2.1/pkgs/apps/raytrace/obj/amd64-linux.gcc-serial --check-build-system CMakeFiles/Makefile.cmake 0
/home/adel/parsec-2.1/pkgs/tools/cmake/inst/amd64-linux.gcc-serial/bin/cmake -E cmake_progress_start /home/adel/parsec-2.1/pkgs/apps/raytrace/obj/amd64-linux.gcc-serial/CMakeFiles /home/adel/parsec-2.1/pkgs/apps/raytrace/obj/amd64-linux.gcc-serial/CMakeFiles/progress.make
/usr/bin/make -f CMakeFiles/Makefile2 all
make[1]: Entering directory `/home/adel/parsec-2.1/pkgs/apps/raytrace/obj/amd64-linux.gcc-serial'
/usr/bin/make -f CMakeFiles/test_glut.dir/build.make CMakeFiles/test_glut.dir/depend
make[2]: Entering directory `/home/adel/parsec-2.1/pkgs/apps/raytrace/obj/amd64-linux.gcc-serial'
cd /home/adel/parsec-2.1/pkgs/apps/raytrace/obj/amd64-linux.gcc-serial && /home/adel/parsec-2.1/pkgs/tools/cmake/inst/amd64-linux.gcc-serial/bin/cmake -E cmake_depends "Unix Makefiles" /home/adel/parsec-2.1/pkgs/apps/raytrace/obj/amd64-linux.gcc-serial /home/adel/parsec-2.1/pkgs/apps/raytrace/obj/amd64-linux.gcc-serial /home/adel/parsec-2.1/pkgs/apps/raytrace/obj/amd64-linux.gcc-serial /home/adel/parsec-2.1/pkgs/apps/raytrace/obj/amd64-linux.gcc-serial /home/adel/parsec-2.1/pkgs/apps/raytrace/obj/amd64-linux.gcc-serial/CMakeFiles/test_glut.dir/DependInfo.cmake --color=
Scanning dependencies of target test_glut
make[2]: Leaving directory `/home/adel/parsec-2.1/pkgs/apps/raytrace/obj/amd64-linux.gcc-serial'
/usr/bin/make -f CMakeFiles/test_glut.dir/build.make CMakeFiles/test_glut.dir/build
make[2]: Entering directory `/home/adel/parsec-2.1/pkgs/apps/raytrace/obj/amd64-linux.gcc-serial'
/home/adel/parsec-2.1/pkgs/tools/cmake/inst/amd64-linux.gcc-serial/bin/cmake -E cmake_progress_report /home/adel/parsec-2.1/pkgs/apps/raytrace/obj/amd64-linux.gcc-serial/CMakeFiles 1
[  4%] Building CXX object CMakeFiles/test_glut.dir/Testing/testglut.o
/usr/bin/g++   -DTHIS_IS_CMAKE -I/home/adel/parsec-2.1/bin/../pkgs/libs/mesa/inst/amd64-linux.gcc-serial/include -O3 -funroll-loops -fprefetch-loop-arrays -fpermissive -fno-exceptions -static-libgcc -Wl,--hash-style=both,--as-needed -DPARSEC_VERSION=2.1 -fexceptions -fno-strict-aliasing -fno-align-labels -DNDEBUG -D_MM_NO_ALIGN_CHECK  -I/home/adel/parsec-2.1/pkgs/libs/mesa/inst/amd64-linux.gcc-serial/include -I/home/adel/parsec-2.1/pkgs/apps/raytrace/obj/amd64-linux.gcc-serial -I/home/adel/parsec-2.1/pkgs/apps/raytrace/obj/amd64-linux.gcc-serial/RTTL -I/home/adel/parsec-2.1/pkgs/apps/raytrace/obj/amd64-linux.gcc-serial/RTTL/common -I/home/adel/parsec-2.1/pkgs/apps/raytrace/obj/amd64-linux.gcc-serial/RTTL/BVH -I/home/adel/parsec-2.1/pkgs/apps/raytrace/obj/amd64-linux.gcc-serial/SG -I/home/adel/parsec-2.1/pkgs/apps/raytrace/obj/amd64-linux.gcc-serial/LRT/include -I/home/adel/parsec-2.1/pkgs/apps/raytrace/obj/amd64-linux.gcc-serial/LRT   -D__root__ -o CMakeFiles/test_glut.dir/Testing/testglut.o -c /home/adel/parsec-2.1/pkgs/apps/raytrace/obj/amd64-linux.gcc-serial/Testing/testglut.cxx
Linking CXX executable bin/test_glut
/home/adel/parsec-2.1/pkgs/tools/cmake/inst/amd64-linux.gcc-serial/bin/cmake -E cmake_link_script CMakeFiles/test_glut.dir/link.txt --verbose=1
/usr/bin/g++   -I/home/adel/parsec-2.1/bin/../pkgs/libs/mesa/inst/amd64-linux.gcc-serial/include -O3 -funroll-loops -fprefetch-loop-arrays -fpermissive -fno-exceptions -static-libgcc -Wl,--hash-style=both,--as-needed -DPARSEC_VERSION=2.1 -fexceptions -fno-strict-aliasing -fno-align-labels -DNDEBUG -D_MM_NO_ALIGN_CHECK   -fPIC -L/home/adel/parsec-2.1/bin/../pkgs/libs/mesa/inst/amd64-linux.gcc-serial/lib -lXext -L/usr/lib64 -L/usr/lib CMakeFiles/test_glut.dir/Testing/testglut.o  -o bin/test_glut -rdynamic -L/home/adel/parsec-2.1/pkgs/libs/mesa/inst/amd64-linux.gcc-serial/lib /home/adel/parsec-2.1/pkgs/libs/mesa/inst/amd64-linux.gcc-serial/lib/libglut.a /home/adel/parsec-2.1/pkgs/libs/mesa/inst/amd64-linux.gcc-serial/lib/libGLU.a /home/adel/parsec-2.1/pkgs/libs/mesa/inst/amd64-linux.gcc-serial/lib/libGL.a -lXext -lXmu -lX11 -lGL -lGLU -lpthread
make[2]: Leaving directory `/home/adel/parsec-2.1/pkgs/apps/raytrace/obj/amd64-linux.gcc-serial'
/home/adel/parsec-2.1/pkgs/tools/cmake/inst/amd64-linux.gcc-serial/bin/cmake -E cmake_progress_report /home/adel/parsec-2.1/pkgs/apps/raytrace/obj/amd64-linux.gcc-serial/CMakeFiles  1
[  4%] Built target test_glut
/usr/bin/make -f RTTL/CMakeFiles/RTTL.dir/build.make RTTL/CMakeFiles/RTTL.dir/depend
make[2]: Entering directory `/home/adel/parsec-2.1/pkgs/apps/raytrace/obj/amd64-linux.gcc-serial'
cd /home/adel/parsec-2.1/pkgs/apps/raytrace/obj/amd64-linux.gcc-serial && /home/adel/parsec-2.1/pkgs/tools/cmake/inst/amd64-linux.gcc-serial/bin/cmake -E cmake_depends "Unix Makefiles" /home/adel/parsec-2.1/pkgs/apps/raytrace/obj/amd64-linux.gcc-serial /home/adel/parsec-2.1/pkgs/apps/raytrace/obj/amd64-linux.gcc-serial/RTTL /home/adel/parsec-2.1/pkgs/apps/raytrace/obj/amd64-linux.gcc-serial /home/adel/parsec-2.1/pkgs/apps/raytrace/obj/amd64-linux.gcc-serial/RTTL /home/adel/parsec-2.1/pkgs/apps/raytrace/obj/amd64-linux.gcc-serial/RTTL/CMakeFiles/RTTL.dir/DependInfo.cmake --color=
Scanning dependencies of target RTTL
make[2]: Leaving directory `/home/adel/parsec-2.1/pkgs/apps/raytrace/obj/amd64-linux.gcc-serial'
/usr/bin/make -f RTTL/CMakeFiles/RTTL.dir/build.make RTTL/CMakeFiles/RTTL.dir/build
make[2]: Entering directory `/home/adel/parsec-2.1/pkgs/apps/raytrace/obj/amd64-linux.gcc-serial'
/home/adel/parsec-2.1/pkgs/tools/cmake/inst/amd64-linux.gcc-serial/bin/cmake -E cmake_progress_report /home/adel/parsec-2.1/pkgs/apps/raytrace/obj/amd64-linux.gcc-serial/CMakeFiles 2
[  9%] Building CXX object RTTL/CMakeFiles/RTTL.dir/BVH/BVH.o
cd /home/adel/parsec-2.1/pkgs/apps/raytrace/obj/amd64-linux.gcc-serial/RTTL && /usr/bin/g++   -DTHIS_IS_CMAKE -I/home/adel/parsec-2.1/bin/../pkgs/libs/mesa/inst/amd64-linux.gcc-serial/include -O3 -funroll-loops -fprefetch-loop-arrays -fpermissive -fno-exceptions -static-libgcc -Wl,--hash-style=both,--as-needed -DPARSEC_VERSION=2.1 -fexceptions -fno-strict-aliasing -fno-align-labels -DNDEBUG -D_MM_NO_ALIGN_CHECK  -I/home/adel/parsec-2.1/pkgs/libs/mesa/inst/amd64-linux.gcc-serial/include -I/home/adel/parsec-2.1/pkgs/apps/raytrace/obj/amd64-linux.gcc-serial -I/home/adel/parsec-2.1/pkgs/apps/raytrace/obj/amd64-linux.gcc-serial/RTTL -I/home/adel/parsec-2.1/pkgs/apps/raytrace/obj/amd64-linux.gcc-serial/RTTL/common -I/home/adel/parsec-2.1/pkgs/apps/raytrace/obj/amd64-linux.gcc-serial/RTTL/BVH -I/home/adel/parsec-2.1/pkgs/apps/raytrace/obj/amd64-linux.gcc-serial/SG -I/home/adel/parsec-2.1/pkgs/apps/raytrace/obj/amd64-linux.gcc-serial/LRT/include -I/home/adel/parsec-2.1/pkgs/apps/raytrace/obj/amd64-linux.gcc-serial/LRT   -D__root__ -o CMakeFiles/RTTL.dir/BVH/BVH.o -c /home/adel/parsec-2.1/pkgs/apps/raytrace/obj/amd64-linux.gcc-serial/RTTL/BVH/BVH.cxx
/home/adel/parsec-2.1/pkgs/apps/raytrace/obj/amd64-linux.gcc-serial/RTTL/BVH/BVH.cxx: In member function 'virtual void RTTL::BVH::build(const RTBoxSSE&, const RTBoxSSE&)':
/home/adel/parsec-2.1/pkgs/apps/raytrace/obj/amd64-linux.gcc-serial/RTTL/BVH/BVH.cxx:15:27: warning: deprecated conversion from string constant to 'char*' [-Wwrite-strings]
       setBuilder("default");
                           ^
/home/adel/parsec-2.1/pkgs/tools/cmake/inst/amd64-linux.gcc-serial/bin/cmake -E cmake_progress_report /home/adel/parsec-2.1/pkgs/apps/raytrace/obj/amd64-linux.gcc-serial/CMakeFiles 3
[ 13%] Building CXX object RTTL/CMakeFiles/RTTL.dir/BVH/Builder/Builder.o
cd /home/adel/parsec-2.1/pkgs/apps/raytrace/obj/amd64-linux.gcc-serial/RTTL && /usr/bin/g++   -DTHIS_IS_CMAKE -I/home/adel/parsec-2.1/bin/../pkgs/libs/mesa/inst/amd64-linux.gcc-serial/include -O3 -funroll-loops -fprefetch-loop-arrays -fpermissive -fno-exceptions -static-libgcc -Wl,--hash-style=both,--as-needed -DPARSEC_VERSION=2.1 -fexceptions -fno-strict-aliasing -fno-align-labels -DNDEBUG -D_MM_NO_ALIGN_CHECK  -I/home/adel/parsec-2.1/pkgs/libs/mesa/inst/amd64-linux.gcc-serial/include -I/home/adel/parsec-2.1/pkgs/apps/raytrace/obj/amd64-linux.gcc-serial -I/home/adel/parsec-2.1/pkgs/apps/raytrace/obj/amd64-linux.gcc-serial/RTTL -I/home/adel/parsec-2.1/pkgs/apps/raytrace/obj/amd64-linux.gcc-serial/RTTL/common -I/home/adel/parsec-2.1/pkgs/apps/raytrace/obj/amd64-linux.gcc-serial/RTTL/BVH -I/home/adel/parsec-2.1/pkgs/apps/raytrace/obj/amd64-linux.gcc-serial/SG -I/home/adel/parsec-2.1/pkgs/apps/raytrace/obj/amd64-linux.gcc-serial/LRT/include -I/home/adel/parsec-2.1/pkgs/apps/raytrace/obj/amd64-linux.gcc-serial/LRT   -D__root__ -o CMakeFiles/RTTL.dir/BVH/Builder/Builder.o -c /home/adel/parsec-2.1/pkgs/apps/raytrace/obj/amd64-linux.gcc-serial/RTTL/BVH/Builder/Builder.cxx
/home/adel/parsec-2.1/pkgs/apps/raytrace/obj/amd64-linux.gcc-serial/RTTL/BVH/Builder/Builder.cxx: In static member function 'static RTTL::BVHBuilder* RTTL::BVHBuilder::get(char*, RTTL::BVH*)':
/home/adel/parsec-2.1/pkgs/apps/raytrace/obj/amd64-linux.gcc-serial/RTTL/BVH/Builder/Builder.cxx:26:31: warning: deprecated conversion from string constant to 'char*' [-Wwrite-strings]
       return get("default",bvh);
                               ^
/home/adel/parsec-2.1/pkgs/tools/cmake/inst/amd64-linux.gcc-serial/bin/cmake -E cmake_progress_report /home/adel/parsec-2.1/pkgs/apps/raytrace/obj/amd64-linux.gcc-serial/CMakeFiles 4
[ 18%] Building CXX object RTTL/CMakeFiles/RTTL.dir/BVH/Builder/Sweep.o
cd /home/adel/parsec-2.1/pkgs/apps/raytrace/obj/amd64-linux.gcc-serial/RTTL && /usr/bin/g++   -DTHIS_IS_CMAKE -I/home/adel/parsec-2.1/bin/../pkgs/libs/mesa/inst/amd64-linux.gcc-serial/include -O3 -funroll-loops -fprefetch-loop-arrays -fpermissive -fno-exceptions -static-libgcc -Wl,--hash-style=both,--as-needed -DPARSEC_VERSION=2.1 -fexceptions -fno-strict-aliasing -fno-align-labels -DNDEBUG -D_MM_NO_ALIGN_CHECK  -I/home/adel/parsec-2.1/pkgs/libs/mesa/inst/amd64-linux.gcc-serial/include -I/home/adel/parsec-2.1/pkgs/apps/raytrace/obj/amd64-linux.gcc-serial -I/home/adel/parsec-2.1/pkgs/apps/raytrace/obj/amd64-linux.gcc-serial/RTTL -I/home/adel/parsec-2.1/pkgs/apps/raytrace/obj/amd64-linux.gcc-serial/RTTL/common -I/home/adel/parsec-2.1/pkgs/apps/raytrace/obj/amd64-linux.gcc-serial/RTTL/BVH -I/home/adel/parsec-2.1/pkgs/apps/raytrace/obj/amd64-linux.gcc-serial/SG -I/home/adel/parsec-2.1/pkgs/apps/raytrace/obj/amd64-linux.gcc-serial/LRT/include -I/home/adel/parsec-2.1/pkgs/apps/raytrace/obj/amd64-linux.gcc-serial/LRT   -D__root__ -o CMakeFiles/RTTL.dir/BVH/Builder/Sweep.o -c /home/adel/parsec-2.1/pkgs/apps/raytrace/obj/amd64-linux.gcc-serial/RTTL/BVH/Builder/Sweep.cxx
/home/adel/parsec-2.1/pkgs/tools/cmake/inst/amd64-linux.gcc-serial/bin/cmake -E cmake_progress_report /home/adel/parsec-2.1/pkgs/apps/raytrace/obj/amd64-linux.gcc-serial/CMakeFiles 5
[ 22%] Building CXX object RTTL/CMakeFiles/RTTL.dir/BVH/Builder/BinnedAllDims.o
cd /home/adel/parsec-2.1/pkgs/apps/raytrace/obj/amd64-linux.gcc-serial/RTTL && /usr/bin/g++   -DTHIS_IS_CMAKE -I/home/adel/parsec-2.1/bin/../pkgs/libs/mesa/inst/amd64-linux.gcc-serial/include -O3 -funroll-loops -fprefetch-loop-arrays -fpermissive -fno-exceptions -static-libgcc -Wl,--hash-style=both,--as-needed -DPARSEC_VERSION=2.1 -fexceptions -fno-strict-aliasing -fno-align-labels -DNDEBUG -D_MM_NO_ALIGN_CHECK  -I/home/adel/parsec-2.1/pkgs/libs/mesa/inst/amd64-linux.gcc-serial/include -I/home/adel/parsec-2.1/pkgs/apps/raytrace/obj/amd64-linux.gcc-serial -I/home/adel/parsec-2.1/pkgs/apps/raytrace/obj/amd64-linux.gcc-serial/RTTL -I/home/adel/parsec-2.1/pkgs/apps/raytrace/obj/amd64-linux.gcc-serial/RTTL/common -I/home/adel/parsec-2.1/pkgs/apps/raytrace/obj/amd64-linux.gcc-serial/RTTL/BVH -I/home/adel/parsec-2.1/pkgs/apps/raytrace/obj/amd64-linux.gcc-serial/SG -I/home/adel/parsec-2.1/pkgs/apps/raytrace/obj/amd64-linux.gcc-serial/LRT/include -I/home/adel/parsec-2.1/pkgs/apps/raytrace/obj/amd64-linux.gcc-serial/LRT   -D__root__ -o CMakeFiles/RTTL.dir/BVH/Builder/BinnedAllDims.o -c /home/adel/parsec-2.1/pkgs/apps/raytrace/obj/amd64-linux.gcc-serial/RTTL/BVH/Builder/BinnedAllDims.cxx
/home/adel/parsec-2.1/pkgs/tools/cmake/inst/amd64-linux.gcc-serial/bin/cmake -E cmake_progress_report /home/adel/parsec-2.1/pkgs/apps/raytrace/obj/amd64-linux.gcc-serial/CMakeFiles 6
[ 27%] Building CXX object RTTL/CMakeFiles/RTTL.dir/BVH/Builder/BinnedAllDimsSaveSpace.o
cd /home/adel/parsec-2.1/pkgs/apps/raytrace/obj/amd64-linux.gcc-serial/RTTL && /usr/bin/g++   -DTHIS_IS_CMAKE -I/home/adel/parsec-2.1/bin/../pkgs/libs/mesa/inst/amd64-linux.gcc-serial/include -O3 -funroll-loops -fprefetch-loop-arrays -fpermissive -fno-exceptions -static-libgcc -Wl,--hash-style=both,--as-needed -DPARSEC_VERSION=2.1 -fexceptions -fno-strict-aliasing -fno-align-labels -DNDEBUG -D_MM_NO_ALIGN_CHECK  -I/home/adel/parsec-2.1/pkgs/libs/mesa/inst/amd64-linux.gcc-serial/include -I/home/adel/parsec-2.1/pkgs/apps/raytrace/obj/amd64-linux.gcc-serial -I/home/adel/parsec-2.1/pkgs/apps/raytrace/obj/amd64-linux.gcc-serial/RTTL -I/home/adel/parsec-2.1/pkgs/apps/raytrace/obj/amd64-linux.gcc-serial/RTTL/common -I/home/adel/parsec-2.1/pkgs/apps/raytrace/obj/amd64-linux.gcc-serial/RTTL/BVH -I/home/adel/parsec-2.1/pkgs/apps/raytrace/obj/amd64-linux.gcc-serial/SG -I/home/adel/parsec-2.1/pkgs/apps/raytrace/obj/amd64-linux.gcc-serial/LRT/include -I/home/adel/parsec-2.1/pkgs/apps/raytrace/obj/amd64-linux.gcc-serial/LRT   -D__root__ -o CMakeFiles/RTTL.dir/BVH/Builder/BinnedAllDimsSaveSpace.o -c /home/adel/parsec-2.1/pkgs/apps/raytrace/obj/amd64-linux.gcc-serial/RTTL/BVH/Builder/BinnedAllDimsSaveSpace.cxx
/home/adel/parsec-2.1/pkgs/tools/cmake/inst/amd64-linux.gcc-serial/bin/cmake -E cmake_progress_report /home/adel/parsec-2.1/pkgs/apps/raytrace/obj/amd64-linux.gcc-serial/CMakeFiles 7
[ 31%] Building CXX object RTTL/CMakeFiles/RTTL.dir/BVH/Builder/OnDemandBuilder.o
cd /home/adel/parsec-2.1/pkgs/apps/raytrace/obj/amd64-linux.gcc-serial/RTTL && /usr/bin/g++   -DTHIS_IS_CMAKE -I/home/adel/parsec-2.1/bin/../pkgs/libs/mesa/inst/amd64-linux.gcc-serial/include -O3 -funroll-loops -fprefetch-loop-arrays -fpermissive -fno-exceptions -static-libgcc -Wl,--hash-style=both,--as-needed -DPARSEC_VERSION=2.1 -fexceptions -fno-strict-aliasing -fno-align-labels -DNDEBUG -D_MM_NO_ALIGN_CHECK  -I/home/adel/parsec-2.1/pkgs/libs/mesa/inst/amd64-linux.gcc-serial/include -I/home/adel/parsec-2.1/pkgs/apps/raytrace/obj/amd64-linux.gcc-serial -I/home/adel/parsec-2.1/pkgs/apps/raytrace/obj/amd64-linux.gcc-serial/RTTL -I/home/adel/parsec-2.1/pkgs/apps/raytrace/obj/amd64-linux.gcc-serial/RTTL/common -I/home/adel/parsec-2.1/pkgs/apps/raytrace/obj/amd64-linux.gcc-serial/RTTL/BVH -I/home/adel/parsec-2.1/pkgs/apps/raytrace/obj/amd64-linux.gcc-serial/SG -I/home/adel/parsec-2.1/pkgs/apps/raytrace/obj/amd64-linux.gcc-serial/LRT/include -I/home/adel/parsec-2.1/pkgs/apps/raytrace/obj/amd64-linux.gcc-serial/LRT   -D__root__ -o CMakeFiles/RTTL.dir/BVH/Builder/OnDemandBuilder.o -c /home/adel/parsec-2.1/pkgs/apps/raytrace/obj/amd64-linux.gcc-serial/RTTL/BVH/Builder/OnDemandBuilder.cxx
/home/adel/parsec-2.1/pkgs/tools/cmake/inst/amd64-linux.gcc-serial/bin/cmake -E cmake_progress_report /home/adel/parsec-2.1/pkgs/apps/raytrace/obj/amd64-linux.gcc-serial/CMakeFiles 8
[ 36%] Building CXX object RTTL/CMakeFiles/RTTL.dir/common/RTThread.o
cd /home/adel/parsec-2.1/pkgs/apps/raytrace/obj/amd64-linux.gcc-serial/RTTL && /usr/bin/g++   -DTHIS_IS_CMAKE -I/home/adel/parsec-2.1/bin/../pkgs/libs/mesa/inst/amd64-linux.gcc-serial/include -O3 -funroll-loops -fprefetch-loop-arrays -fpermissive -fno-exceptions -static-libgcc -Wl,--hash-style=both,--as-needed -DPARSEC_VERSION=2.1 -fexceptions -fno-strict-aliasing -fno-align-labels -DNDEBUG -D_MM_NO_ALIGN_CHECK  -I/home/adel/parsec-2.1/pkgs/libs/mesa/inst/amd64-linux.gcc-serial/include -I/home/adel/parsec-2.1/pkgs/apps/raytrace/obj/amd64-linux.gcc-serial -I/home/adel/parsec-2.1/pkgs/apps/raytrace/obj/amd64-linux.gcc-serial/RTTL -I/home/adel/parsec-2.1/pkgs/apps/raytrace/obj/amd64-linux.gcc-serial/RTTL/common -I/home/adel/parsec-2.1/pkgs/apps/raytrace/obj/amd64-linux.gcc-serial/RTTL/BVH -I/home/adel/parsec-2.1/pkgs/apps/raytrace/obj/amd64-linux.gcc-serial/SG -I/home/adel/parsec-2.1/pkgs/apps/raytrace/obj/amd64-linux.gcc-serial/LRT/include -I/home/adel/parsec-2.1/pkgs/apps/raytrace/obj/amd64-linux.gcc-serial/LRT   -D__root__ -o CMakeFiles/RTTL.dir/common/RTThread.o -c /home/adel/parsec-2.1/pkgs/apps/raytrace/obj/amd64-linux.gcc-serial/RTTL/common/RTThread.cxx
In file included from /home/adel/parsec-2.1/pkgs/apps/raytrace/obj/amd64-linux.gcc-serial/RTTL/common/RTThread.cxx:1:0:
/home/adel/parsec-2.1/pkgs/apps/raytrace/obj/amd64-linux.gcc-serial/RTTL/common/RTThread.hxx: In function 'int atomic_add(atomic_t*, int)':
/home/adel/parsec-2.1/pkgs/apps/raytrace/obj/amd64-linux.gcc-serial/RTTL/common/RTThread.hxx:21:40: warning: invalid conversion from 'atomic_t* {aka volatile int*}' to 'volatile unsigned int*' [-fpermissive]
     flag=atomic_cmpset_32(v, temp_v, rv);
                                        ^
In file included from /home/adel/parsec-2.1/pkgs/apps/raytrace/obj/amd64-linux.gcc-serial/RTTL/common/atomic/atomic.h:28:0,
                 from /home/adel/parsec-2.1/pkgs/apps/raytrace/obj/amd64-linux.gcc-serial/RTTL/common/RTThread.hxx:10,
                 from /home/adel/parsec-2.1/pkgs/apps/raytrace/obj/amd64-linux.gcc-serial/RTTL/common/RTThread.cxx:1:
/home/adel/parsec-2.1/pkgs/apps/raytrace/obj/amd64-linux.gcc-serial/RTTL/common/atomic/amd64/atomic.h:88:1: warning:   initializing argument 1 of 'int atomic_cmpset_int(volatile unsigned int*, unsigned int, unsigned int)' [-fpermissive]
 atomic_cmpset_int(volatile u_int *dst, u_int exp, u_int src)
 ^
/home/adel/parsec-2.1/pkgs/tools/cmake/inst/amd64-linux.gcc-serial/bin/cmake -E cmake_progress_report /home/adel/parsec-2.1/pkgs/apps/raytrace/obj/amd64-linux.gcc-serial/CMakeFiles 9
[ 40%] Building CXX object RTTL/CMakeFiles/RTTL.dir/common/MapOptions.o
cd /home/adel/parsec-2.1/pkgs/apps/raytrace/obj/amd64-linux.gcc-serial/RTTL && /usr/bin/g++   -DTHIS_IS_CMAKE -I/home/adel/parsec-2.1/bin/../pkgs/libs/mesa/inst/amd64-linux.gcc-serial/include -O3 -funroll-loops -fprefetch-loop-arrays -fpermissive -fno-exceptions -static-libgcc -Wl,--hash-style=both,--as-needed -DPARSEC_VERSION=2.1 -fexceptions -fno-strict-aliasing -fno-align-labels -DNDEBUG -D_MM_NO_ALIGN_CHECK  -I/home/adel/parsec-2.1/pkgs/libs/mesa/inst/amd64-linux.gcc-serial/include -I/home/adel/parsec-2.1/pkgs/apps/raytrace/obj/amd64-linux.gcc-serial -I/home/adel/parsec-2.1/pkgs/apps/raytrace/obj/amd64-linux.gcc-serial/RTTL -I/home/adel/parsec-2.1/pkgs/apps/raytrace/obj/amd64-linux.gcc-serial/RTTL/common -I/home/adel/parsec-2.1/pkgs/apps/raytrace/obj/amd64-linux.gcc-serial/RTTL/BVH -I/home/adel/parsec-2.1/pkgs/apps/raytrace/obj/amd64-linux.gcc-serial/SG -I/home/adel/parsec-2.1/pkgs/apps/raytrace/obj/amd64-linux.gcc-serial/LRT/include -I/home/adel/parsec-2.1/pkgs/apps/raytrace/obj/amd64-linux.gcc-serial/LRT   -D__root__ -o CMakeFiles/RTTL.dir/common/MapOptions.o -c /home/adel/parsec-2.1/pkgs/apps/raytrace/obj/amd64-linux.gcc-serial/RTTL/common/MapOptions.cxx
/home/adel/parsec-2.1/pkgs/tools/cmake/inst/amd64-linux.gcc-serial/bin/cmake -E cmake_progress_report /home/adel/parsec-2.1/pkgs/apps/raytrace/obj/amd64-linux.gcc-serial/CMakeFiles 10
[ 45%] Building CXX object RTTL/CMakeFiles/RTTL.dir/API/ISG.o
cd /home/adel/parsec-2.1/pkgs/apps/raytrace/obj/amd64-linux.gcc-serial/RTTL && /usr/bin/g++   -DTHIS_IS_CMAKE -I/home/adel/parsec-2.1/bin/../pkgs/libs/mesa/inst/amd64-linux.gcc-serial/include -O3 -funroll-loops -fprefetch-loop-arrays -fpermissive -fno-exceptions -static-libgcc -Wl,--hash-style=both,--as-needed -DPARSEC_VERSION=2.1 -fexceptions -fno-strict-aliasing -fno-align-labels -DNDEBUG -D_MM_NO_ALIGN_CHECK  -I/home/adel/parsec-2.1/pkgs/libs/mesa/inst/amd64-linux.gcc-serial/include -I/home/adel/parsec-2.1/pkgs/apps/raytrace/obj/amd64-linux.gcc-serial -I/home/adel/parsec-2.1/pkgs/apps/raytrace/obj/amd64-linux.gcc-serial/RTTL -I/home/adel/parsec-2.1/pkgs/apps/raytrace/obj/amd64-linux.gcc-serial/RTTL/common -I/home/adel/parsec-2.1/pkgs/apps/raytrace/obj/amd64-linux.gcc-serial/RTTL/BVH -I/home/adel/parsec-2.1/pkgs/apps/raytrace/obj/amd64-linux.gcc-serial/SG -I/home/adel/parsec-2.1/pkgs/apps/raytrace/obj/amd64-linux.gcc-serial/LRT/include -I/home/adel/parsec-2.1/pkgs/apps/raytrace/obj/amd64-linux.gcc-serial/LRT   -D__root__ -o CMakeFiles/RTTL.dir/API/ISG.o -c /home/adel/parsec-2.1/pkgs/apps/raytrace/obj/amd64-linux.gcc-serial/RTTL/API/ISG.cxx
Linking CXX static library ../lib/libRTTL.a
cd /home/adel/parsec-2.1/pkgs/apps/raytrace/obj/amd64-linux.gcc-serial/RTTL && /home/adel/parsec-2.1/pkgs/tools/cmake/inst/amd64-linux.gcc-serial/bin/cmake -P CMakeFiles/RTTL.dir/cmake_clean_target.cmake
cd /home/adel/parsec-2.1/pkgs/apps/raytrace/obj/amd64-linux.gcc-serial/RTTL && /home/adel/parsec-2.1/pkgs/tools/cmake/inst/amd64-linux.gcc-serial/bin/cmake -E cmake_link_script CMakeFiles/RTTL.dir/link.txt --verbose=1
/usr/bin/ar cr ../lib/libRTTL.a  CMakeFiles/RTTL.dir/BVH/BVH.o CMakeFiles/RTTL.dir/BVH/Builder/Builder.o CMakeFiles/RTTL.dir/BVH/Builder/Sweep.o CMakeFiles/RTTL.dir/BVH/Builder/BinnedAllDims.o CMakeFiles/RTTL.dir/BVH/Builder/BinnedAllDimsSaveSpace.o CMakeFiles/RTTL.dir/BVH/Builder/OnDemandBuilder.o CMakeFiles/RTTL.dir/common/RTThread.o CMakeFiles/RTTL.dir/common/MapOptions.o CMakeFiles/RTTL.dir/API/ISG.o
/usr/bin/ranlib ../lib/libRTTL.a
make[2]: Leaving directory `/home/adel/parsec-2.1/pkgs/apps/raytrace/obj/amd64-linux.gcc-serial'
/home/adel/parsec-2.1/pkgs/tools/cmake/inst/amd64-linux.gcc-serial/bin/cmake -E cmake_progress_report /home/adel/parsec-2.1/pkgs/apps/raytrace/obj/amd64-linux.gcc-serial/CMakeFiles  2 3 4 5 6 7 8 9 10
[ 45%] Built target RTTL
/usr/bin/make -f RTTL/CMakeFiles/TestOptions.dir/build.make RTTL/CMakeFiles/TestOptions.dir/depend
make[2]: Entering directory `/home/adel/parsec-2.1/pkgs/apps/raytrace/obj/amd64-linux.gcc-serial'
cd /home/adel/parsec-2.1/pkgs/apps/raytrace/obj/amd64-linux.gcc-serial && /home/adel/parsec-2.1/pkgs/tools/cmake/inst/amd64-linux.gcc-serial/bin/cmake -E cmake_depends "Unix Makefiles" /home/adel/parsec-2.1/pkgs/apps/raytrace/obj/amd64-linux.gcc-serial /home/adel/parsec-2.1/pkgs/apps/raytrace/obj/amd64-linux.gcc-serial/RTTL /home/adel/parsec-2.1/pkgs/apps/raytrace/obj/amd64-linux.gcc-serial /home/adel/parsec-2.1/pkgs/apps/raytrace/obj/amd64-linux.gcc-serial/RTTL /home/adel/parsec-2.1/pkgs/apps/raytrace/obj/amd64-linux.gcc-serial/RTTL/CMakeFiles/TestOptions.dir/DependInfo.cmake --color=
Scanning dependencies of target TestOptions
make[2]: Leaving directory `/home/adel/parsec-2.1/pkgs/apps/raytrace/obj/amd64-linux.gcc-serial'
/usr/bin/make -f RTTL/CMakeFiles/TestOptions.dir/build.make RTTL/CMakeFiles/TestOptions.dir/build
make[2]: Entering directory `/home/adel/parsec-2.1/pkgs/apps/raytrace/obj/amd64-linux.gcc-serial'
/home/adel/parsec-2.1/pkgs/tools/cmake/inst/amd64-linux.gcc-serial/bin/cmake -E cmake_progress_report /home/adel/parsec-2.1/pkgs/apps/raytrace/obj/amd64-linux.gcc-serial/CMakeFiles 11
[ 50%] Building CXX object RTTL/CMakeFiles/TestOptions.dir/test/TestOptions/TestOptions.o
cd /home/adel/parsec-2.1/pkgs/apps/raytrace/obj/amd64-linux.gcc-serial/RTTL && /usr/bin/g++   -DTHIS_IS_CMAKE -I/home/adel/parsec-2.1/bin/../pkgs/libs/mesa/inst/amd64-linux.gcc-serial/include -O3 -funroll-loops -fprefetch-loop-arrays -fpermissive -fno-exceptions -static-libgcc -Wl,--hash-style=both,--as-needed -DPARSEC_VERSION=2.1 -fexceptions -fno-strict-aliasing -fno-align-labels -DNDEBUG -D_MM_NO_ALIGN_CHECK  -I/home/adel/parsec-2.1/pkgs/libs/mesa/inst/amd64-linux.gcc-serial/include -I/home/adel/parsec-2.1/pkgs/apps/raytrace/obj/amd64-linux.gcc-serial -I/home/adel/parsec-2.1/pkgs/apps/raytrace/obj/amd64-linux.gcc-serial/RTTL -I/home/adel/parsec-2.1/pkgs/apps/raytrace/obj/amd64-linux.gcc-serial/RTTL/common -I/home/adel/parsec-2.1/pkgs/apps/raytrace/obj/amd64-linux.gcc-serial/RTTL/BVH -I/home/adel/parsec-2.1/pkgs/apps/raytrace/obj/amd64-linux.gcc-serial/SG -I/home/adel/parsec-2.1/pkgs/apps/raytrace/obj/amd64-linux.gcc-serial/LRT/include -I/home/adel/parsec-2.1/pkgs/apps/raytrace/obj/amd64-linux.gcc-serial/LRT   -D__root__ -o CMakeFiles/TestOptions.dir/test/TestOptions/TestOptions.o -c /home/adel/parsec-2.1/pkgs/apps/raytrace/obj/amd64-linux.gcc-serial/RTTL/test/TestOptions/TestOptions.cxx
Linking CXX executable ../bin/TestOptions
cd /home/adel/parsec-2.1/pkgs/apps/raytrace/obj/amd64-linux.gcc-serial/RTTL && /home/adel/parsec-2.1/pkgs/tools/cmake/inst/amd64-linux.gcc-serial/bin/cmake -E cmake_link_script CMakeFiles/TestOptions.dir/link.txt --verbose=1
/usr/bin/g++   -I/home/adel/parsec-2.1/bin/../pkgs/libs/mesa/inst/amd64-linux.gcc-serial/include -O3 -funroll-loops -fprefetch-loop-arrays -fpermissive -fno-exceptions -static-libgcc -Wl,--hash-style=both,--as-needed -DPARSEC_VERSION=2.1 -fexceptions -fno-strict-aliasing -fno-align-labels -DNDEBUG -D_MM_NO_ALIGN_CHECK   -fPIC -L/home/adel/parsec-2.1/bin/../pkgs/libs/mesa/inst/amd64-linux.gcc-serial/lib -lXext -L/usr/lib64 -L/usr/lib CMakeFiles/TestOptions.dir/test/TestOptions/TestOptions.o  -o ../bin/TestOptions -rdynamic
make[2]: Leaving directory `/home/adel/parsec-2.1/pkgs/apps/raytrace/obj/amd64-linux.gcc-serial'
/home/adel/parsec-2.1/pkgs/tools/cmake/inst/amd64-linux.gcc-serial/bin/cmake -E cmake_progress_report /home/adel/parsec-2.1/pkgs/apps/raytrace/obj/amd64-linux.gcc-serial/CMakeFiles  11
[ 50%] Built target TestOptions
/usr/bin/make -f RTTL/CMakeFiles/test_newmesh.dir/build.make RTTL/CMakeFiles/test_newmesh.dir/depend
make[2]: Entering directory `/home/adel/parsec-2.1/pkgs/apps/raytrace/obj/amd64-linux.gcc-serial'
cd /home/adel/parsec-2.1/pkgs/apps/raytrace/obj/amd64-linux.gcc-serial && /home/adel/parsec-2.1/pkgs/tools/cmake/inst/amd64-linux.gcc-serial/bin/cmake -E cmake_depends "Unix Makefiles" /home/adel/parsec-2.1/pkgs/apps/raytrace/obj/amd64-linux.gcc-serial /home/adel/parsec-2.1/pkgs/apps/raytrace/obj/amd64-linux.gcc-serial/RTTL /home/adel/parsec-2.1/pkgs/apps/raytrace/obj/amd64-linux.gcc-serial /home/adel/parsec-2.1/pkgs/apps/raytrace/obj/amd64-linux.gcc-serial/RTTL /home/adel/parsec-2.1/pkgs/apps/raytrace/obj/amd64-linux.gcc-serial/RTTL/CMakeFiles/test_newmesh.dir/DependInfo.cmake --color=
Scanning dependencies of target test_newmesh
make[2]: Leaving directory `/home/adel/parsec-2.1/pkgs/apps/raytrace/obj/amd64-linux.gcc-serial'
/usr/bin/make -f RTTL/CMakeFiles/test_newmesh.dir/build.make RTTL/CMakeFiles/test_newmesh.dir/build
make[2]: Entering directory `/home/adel/parsec-2.1/pkgs/apps/raytrace/obj/amd64-linux.gcc-serial'
/home/adel/parsec-2.1/pkgs/tools/cmake/inst/amd64-linux.gcc-serial/bin/cmake -E cmake_progress_report /home/adel/parsec-2.1/pkgs/apps/raytrace/obj/amd64-linux.gcc-serial/CMakeFiles 12
[ 54%] Building CXX object RTTL/CMakeFiles/test_newmesh.dir/test/api_newmesh/newmesh.o
cd /home/adel/parsec-2.1/pkgs/apps/raytrace/obj/amd64-linux.gcc-serial/RTTL && /usr/bin/g++   -DTHIS_IS_CMAKE -I/home/adel/parsec-2.1/bin/../pkgs/libs/mesa/inst/amd64-linux.gcc-serial/include -O3 -funroll-loops -fprefetch-loop-arrays -fpermissive -fno-exceptions -static-libgcc -Wl,--hash-style=both,--as-needed -DPARSEC_VERSION=2.1 -fexceptions -fno-strict-aliasing -fno-align-labels -DNDEBUG -D_MM_NO_ALIGN_CHECK  -I/home/adel/parsec-2.1/pkgs/libs/mesa/inst/amd64-linux.gcc-serial/include -I/home/adel/parsec-2.1/pkgs/apps/raytrace/obj/amd64-linux.gcc-serial -I/home/adel/parsec-2.1/pkgs/apps/raytrace/obj/amd64-linux.gcc-serial/RTTL -I/home/adel/parsec-2.1/pkgs/apps/raytrace/obj/amd64-linux.gcc-serial/RTTL/common -I/home/adel/parsec-2.1/pkgs/apps/raytrace/obj/amd64-linux.gcc-serial/RTTL/BVH -I/home/adel/parsec-2.1/pkgs/apps/raytrace/obj/amd64-linux.gcc-serial/SG -I/home/adel/parsec-2.1/pkgs/apps/raytrace/obj/amd64-linux.gcc-serial/LRT/include -I/home/adel/parsec-2.1/pkgs/apps/raytrace/obj/amd64-linux.gcc-serial/LRT   -D__root__ -o CMakeFiles/test_newmesh.dir/test/api_newmesh/newmesh.o -c /home/adel/parsec-2.1/pkgs/apps/raytrace/obj/amd64-linux.gcc-serial/RTTL/test/api_newmesh/newmesh.cxx
Linking CXX executable ../bin/test_newmesh
cd /home/adel/parsec-2.1/pkgs/apps/raytrace/obj/amd64-linux.gcc-serial/RTTL && /home/adel/parsec-2.1/pkgs/tools/cmake/inst/amd64-linux.gcc-serial/bin/cmake -E cmake_link_script CMakeFiles/test_newmesh.dir/link.txt --verbose=1
/usr/bin/g++   -I/home/adel/parsec-2.1/bin/../pkgs/libs/mesa/inst/amd64-linux.gcc-serial/include -O3 -funroll-loops -fprefetch-loop-arrays -fpermissive -fno-exceptions -static-libgcc -Wl,--hash-style=both,--as-needed -DPARSEC_VERSION=2.1 -fexceptions -fno-strict-aliasing -fno-align-labels -DNDEBUG -D_MM_NO_ALIGN_CHECK   -fPIC -L/home/adel/parsec-2.1/bin/../pkgs/libs/mesa/inst/amd64-linux.gcc-serial/lib -lXext -L/usr/lib64 -L/usr/lib CMakeFiles/test_newmesh.dir/test/api_newmesh/newmesh.o  -o ../bin/test_newmesh -rdynamic -L/home/adel/parsec-2.1/pkgs/apps/raytrace/obj/amd64-linux.gcc-serial/lib ../lib/libRTTL.a -lstdc++ -lpthread
make[2]: Leaving directory `/home/adel/parsec-2.1/pkgs/apps/raytrace/obj/amd64-linux.gcc-serial'
/home/adel/parsec-2.1/pkgs/tools/cmake/inst/amd64-linux.gcc-serial/bin/cmake -E cmake_progress_report /home/adel/parsec-2.1/pkgs/apps/raytrace/obj/amd64-linux.gcc-serial/CMakeFiles  12
[ 54%] Built target test_newmesh
/usr/bin/make -f RTTL/CMakeFiles/test_rtvec.dir/build.make RTTL/CMakeFiles/test_rtvec.dir/depend
make[2]: Entering directory `/home/adel/parsec-2.1/pkgs/apps/raytrace/obj/amd64-linux.gcc-serial'
cd /home/adel/parsec-2.1/pkgs/apps/raytrace/obj/amd64-linux.gcc-serial && /home/adel/parsec-2.1/pkgs/tools/cmake/inst/amd64-linux.gcc-serial/bin/cmake -E cmake_depends "Unix Makefiles" /home/adel/parsec-2.1/pkgs/apps/raytrace/obj/amd64-linux.gcc-serial /home/adel/parsec-2.1/pkgs/apps/raytrace/obj/amd64-linux.gcc-serial/RTTL /home/adel/parsec-2.1/pkgs/apps/raytrace/obj/amd64-linux.gcc-serial /home/adel/parsec-2.1/pkgs/apps/raytrace/obj/amd64-linux.gcc-serial/RTTL /home/adel/parsec-2.1/pkgs/apps/raytrace/obj/amd64-linux.gcc-serial/RTTL/CMakeFiles/test_rtvec.dir/DependInfo.cmake --color=
Scanning dependencies of target test_rtvec
make[2]: Leaving directory `/home/adel/parsec-2.1/pkgs/apps/raytrace/obj/amd64-linux.gcc-serial'
/usr/bin/make -f RTTL/CMakeFiles/test_rtvec.dir/build.make RTTL/CMakeFiles/test_rtvec.dir/build
make[2]: Entering directory `/home/adel/parsec-2.1/pkgs/apps/raytrace/obj/amd64-linux.gcc-serial'
/home/adel/parsec-2.1/pkgs/tools/cmake/inst/amd64-linux.gcc-serial/bin/cmake -E cmake_progress_report /home/adel/parsec-2.1/pkgs/apps/raytrace/obj/amd64-linux.gcc-serial/CMakeFiles 13
[ 59%] Building CXX object RTTL/CMakeFiles/test_rtvec.dir/test/TestRTVec/TestRTVec.o
cd /home/adel/parsec-2.1/pkgs/apps/raytrace/obj/amd64-linux.gcc-serial/RTTL && /usr/bin/g++   -DTHIS_IS_CMAKE -I/home/adel/parsec-2.1/bin/../pkgs/libs/mesa/inst/amd64-linux.gcc-serial/include -O3 -funroll-loops -fprefetch-loop-arrays -fpermissive -fno-exceptions -static-libgcc -Wl,--hash-style=both,--as-needed -DPARSEC_VERSION=2.1 -fexceptions -fno-strict-aliasing -fno-align-labels -DNDEBUG -D_MM_NO_ALIGN_CHECK  -I/home/adel/parsec-2.1/pkgs/libs/mesa/inst/amd64-linux.gcc-serial/include -I/home/adel/parsec-2.1/pkgs/apps/raytrace/obj/amd64-linux.gcc-serial -I/home/adel/parsec-2.1/pkgs/apps/raytrace/obj/amd64-linux.gcc-serial/RTTL -I/home/adel/parsec-2.1/pkgs/apps/raytrace/obj/amd64-linux.gcc-serial/RTTL/common -I/home/adel/parsec-2.1/pkgs/apps/raytrace/obj/amd64-linux.gcc-serial/RTTL/BVH -I/home/adel/parsec-2.1/pkgs/apps/raytrace/obj/amd64-linux.gcc-serial/SG -I/home/adel/parsec-2.1/pkgs/apps/raytrace/obj/amd64-linux.gcc-serial/LRT/include -I/home/adel/parsec-2.1/pkgs/apps/raytrace/obj/amd64-linux.gcc-serial/LRT   -D__root__ -o CMakeFiles/test_rtvec.dir/test/TestRTVec/TestRTVec.o -c /home/adel/parsec-2.1/pkgs/apps/raytrace/obj/amd64-linux.gcc-serial/RTTL/test/TestRTVec/TestRTVec.cxx
Linking CXX executable ../bin/test_rtvec
cd /home/adel/parsec-2.1/pkgs/apps/raytrace/obj/amd64-linux.gcc-serial/RTTL && /home/adel/parsec-2.1/pkgs/tools/cmake/inst/amd64-linux.gcc-serial/bin/cmake -E cmake_link_script CMakeFiles/test_rtvec.dir/link.txt --verbose=1
/usr/bin/g++   -I/home/adel/parsec-2.1/bin/../pkgs/libs/mesa/inst/amd64-linux.gcc-serial/include -O3 -funroll-loops -fprefetch-loop-arrays -fpermissive -fno-exceptions -static-libgcc -Wl,--hash-style=both,--as-needed -DPARSEC_VERSION=2.1 -fexceptions -fno-strict-aliasing -fno-align-labels -DNDEBUG -D_MM_NO_ALIGN_CHECK   -fPIC -L/home/adel/parsec-2.1/bin/../pkgs/libs/mesa/inst/amd64-linux.gcc-serial/lib -lXext -L/usr/lib64 -L/usr/lib CMakeFiles/test_rtvec.dir/test/TestRTVec/TestRTVec.o  -o ../bin/test_rtvec -rdynamic
make[2]: Leaving directory `/home/adel/parsec-2.1/pkgs/apps/raytrace/obj/amd64-linux.gcc-serial'
/home/adel/parsec-2.1/pkgs/tools/cmake/inst/amd64-linux.gcc-serial/bin/cmake -E cmake_progress_report /home/adel/parsec-2.1/pkgs/apps/raytrace/obj/amd64-linux.gcc-serial/CMakeFiles  13
[ 59%] Built target test_rtvec
/usr/bin/make -f RTTL/CMakeFiles/test_vertex_conversion.dir/build.make RTTL/CMakeFiles/test_vertex_conversion.dir/depend
make[2]: Entering directory `/home/adel/parsec-2.1/pkgs/apps/raytrace/obj/amd64-linux.gcc-serial'
cd /home/adel/parsec-2.1/pkgs/apps/raytrace/obj/amd64-linux.gcc-serial && /home/adel/parsec-2.1/pkgs/tools/cmake/inst/amd64-linux.gcc-serial/bin/cmake -E cmake_depends "Unix Makefiles" /home/adel/parsec-2.1/pkgs/apps/raytrace/obj/amd64-linux.gcc-serial /home/adel/parsec-2.1/pkgs/apps/raytrace/obj/amd64-linux.gcc-serial/RTTL /home/adel/parsec-2.1/pkgs/apps/raytrace/obj/amd64-linux.gcc-serial /home/adel/parsec-2.1/pkgs/apps/raytrace/obj/amd64-linux.gcc-serial/RTTL /home/adel/parsec-2.1/pkgs/apps/raytrace/obj/amd64-linux.gcc-serial/RTTL/CMakeFiles/test_vertex_conversion.dir/DependInfo.cmake --color=
Scanning dependencies of target test_vertex_conversion
make[2]: Leaving directory `/home/adel/parsec-2.1/pkgs/apps/raytrace/obj/amd64-linux.gcc-serial'
/usr/bin/make -f RTTL/CMakeFiles/test_vertex_conversion.dir/build.make RTTL/CMakeFiles/test_vertex_conversion.dir/build
make[2]: Entering directory `/home/adel/parsec-2.1/pkgs/apps/raytrace/obj/amd64-linux.gcc-serial'
/home/adel/parsec-2.1/pkgs/tools/cmake/inst/amd64-linux.gcc-serial/bin/cmake -E cmake_progress_report /home/adel/parsec-2.1/pkgs/apps/raytrace/obj/amd64-linux.gcc-serial/CMakeFiles 14
[ 63%] Building CXX object RTTL/CMakeFiles/test_vertex_conversion.dir/test/api_vertex_conversion/vertex_conversion.o
cd /home/adel/parsec-2.1/pkgs/apps/raytrace/obj/amd64-linux.gcc-serial/RTTL && /usr/bin/g++   -DTHIS_IS_CMAKE -I/home/adel/parsec-2.1/bin/../pkgs/libs/mesa/inst/amd64-linux.gcc-serial/include -O3 -funroll-loops -fprefetch-loop-arrays -fpermissive -fno-exceptions -static-libgcc -Wl,--hash-style=both,--as-needed -DPARSEC_VERSION=2.1 -fexceptions -fno-strict-aliasing -fno-align-labels -DNDEBUG -D_MM_NO_ALIGN_CHECK  -I/home/adel/parsec-2.1/pkgs/libs/mesa/inst/amd64-linux.gcc-serial/include -I/home/adel/parsec-2.1/pkgs/apps/raytrace/obj/amd64-linux.gcc-serial -I/home/adel/parsec-2.1/pkgs/apps/raytrace/obj/amd64-linux.gcc-serial/RTTL -I/home/adel/parsec-2.1/pkgs/apps/raytrace/obj/amd64-linux.gcc-serial/RTTL/common -I/home/adel/parsec-2.1/pkgs/apps/raytrace/obj/amd64-linux.gcc-serial/RTTL/BVH -I/home/adel/parsec-2.1/pkgs/apps/raytrace/obj/amd64-linux.gcc-serial/SG -I/home/adel/parsec-2.1/pkgs/apps/raytrace/obj/amd64-linux.gcc-serial/LRT/include -I/home/adel/parsec-2.1/pkgs/apps/raytrace/obj/amd64-linux.gcc-serial/LRT   -D__root__ -o CMakeFiles/test_vertex_conversion.dir/test/api_vertex_conversion/vertex_conversion.o -c /home/adel/parsec-2.1/pkgs/apps/raytrace/obj/amd64-linux.gcc-serial/RTTL/test/api_vertex_conversion/vertex_conversion.cxx
Linking CXX executable ../bin/test_vertex_conversion
cd /home/adel/parsec-2.1/pkgs/apps/raytrace/obj/amd64-linux.gcc-serial/RTTL && /home/adel/parsec-2.1/pkgs/tools/cmake/inst/amd64-linux.gcc-serial/bin/cmake -E cmake_link_script CMakeFiles/test_vertex_conversion.dir/link.txt --verbose=1
/usr/bin/g++   -I/home/adel/parsec-2.1/bin/../pkgs/libs/mesa/inst/amd64-linux.gcc-serial/include -O3 -funroll-loops -fprefetch-loop-arrays -fpermissive -fno-exceptions -static-libgcc -Wl,--hash-style=both,--as-needed -DPARSEC_VERSION=2.1 -fexceptions -fno-strict-aliasing -fno-align-labels -DNDEBUG -D_MM_NO_ALIGN_CHECK   -fPIC -L/home/adel/parsec-2.1/bin/../pkgs/libs/mesa/inst/amd64-linux.gcc-serial/lib -lXext -L/usr/lib64 -L/usr/lib CMakeFiles/test_vertex_conversion.dir/test/api_vertex_conversion/vertex_conversion.o  -o ../bin/test_vertex_conversion -rdynamic -L/home/adel/parsec-2.1/pkgs/apps/raytrace/obj/amd64-linux.gcc-serial/lib ../lib/libRTTL.a -lstdc++ -lpthread
make[2]: Leaving directory `/home/adel/parsec-2.1/pkgs/apps/raytrace/obj/amd64-linux.gcc-serial'
/home/adel/parsec-2.1/pkgs/tools/cmake/inst/amd64-linux.gcc-serial/bin/cmake -E cmake_progress_report /home/adel/parsec-2.1/pkgs/apps/raytrace/obj/amd64-linux.gcc-serial/CMakeFiles  14
[ 63%] Built target test_vertex_conversion
/usr/bin/make -f LRT/CMakeFiles/LRT.dir/build.make LRT/CMakeFiles/LRT.dir/depend
make[2]: Entering directory `/home/adel/parsec-2.1/pkgs/apps/raytrace/obj/amd64-linux.gcc-serial'
cd /home/adel/parsec-2.1/pkgs/apps/raytrace/obj/amd64-linux.gcc-serial && /home/adel/parsec-2.1/pkgs/tools/cmake/inst/amd64-linux.gcc-serial/bin/cmake -E cmake_depends "Unix Makefiles" /home/adel/parsec-2.1/pkgs/apps/raytrace/obj/amd64-linux.gcc-serial /home/adel/parsec-2.1/pkgs/apps/raytrace/obj/amd64-linux.gcc-serial/LRT /home/adel/parsec-2.1/pkgs/apps/raytrace/obj/amd64-linux.gcc-serial /home/adel/parsec-2.1/pkgs/apps/raytrace/obj/amd64-linux.gcc-serial/LRT /home/adel/parsec-2.1/pkgs/apps/raytrace/obj/amd64-linux.gcc-serial/LRT/CMakeFiles/LRT.dir/DependInfo.cmake --color=
Scanning dependencies of target LRT
make[2]: Leaving directory `/home/adel/parsec-2.1/pkgs/apps/raytrace/obj/amd64-linux.gcc-serial'
/usr/bin/make -f LRT/CMakeFiles/LRT.dir/build.make LRT/CMakeFiles/LRT.dir/build
make[2]: Entering directory `/home/adel/parsec-2.1/pkgs/apps/raytrace/obj/amd64-linux.gcc-serial'
/home/adel/parsec-2.1/pkgs/tools/cmake/inst/amd64-linux.gcc-serial/bin/cmake -E cmake_progress_report /home/adel/parsec-2.1/pkgs/apps/raytrace/obj/amd64-linux.gcc-serial/CMakeFiles 15
[ 68%] Building CXX object LRT/CMakeFiles/LRT.dir/Init.o
cd /home/adel/parsec-2.1/pkgs/apps/raytrace/obj/amd64-linux.gcc-serial/LRT && /usr/bin/g++   -DTHIS_IS_CMAKE -I/home/adel/parsec-2.1/bin/../pkgs/libs/mesa/inst/amd64-linux.gcc-serial/include -O3 -funroll-loops -fprefetch-loop-arrays -fpermissive -fno-exceptions -static-libgcc -Wl,--hash-style=both,--as-needed -DPARSEC_VERSION=2.1 -fexceptions -fno-strict-aliasing -fno-align-labels -DNDEBUG -D_MM_NO_ALIGN_CHECK  -I/home/adel/parsec-2.1/pkgs/libs/mesa/inst/amd64-linux.gcc-serial/include -I/home/adel/parsec-2.1/pkgs/apps/raytrace/obj/amd64-linux.gcc-serial -I/home/adel/parsec-2.1/pkgs/apps/raytrace/obj/amd64-linux.gcc-serial/RTTL -I/home/adel/parsec-2.1/pkgs/apps/raytrace/obj/amd64-linux.gcc-serial/RTTL/common -I/home/adel/parsec-2.1/pkgs/apps/raytrace/obj/amd64-linux.gcc-serial/RTTL/BVH -I/home/adel/parsec-2.1/pkgs/apps/raytrace/obj/amd64-linux.gcc-serial/SG -I/home/adel/parsec-2.1/pkgs/apps/raytrace/obj/amd64-linux.gcc-serial/LRT/include -I/home/adel/parsec-2.1/pkgs/apps/raytrace/obj/amd64-linux.gcc-serial/LRT   -D__root__ -o CMakeFiles/LRT.dir/Init.o -c /home/adel/parsec-2.1/pkgs/apps/raytrace/obj/amd64-linux.gcc-serial/LRT/Init.cxx
/home/adel/parsec-2.1/pkgs/tools/cmake/inst/amd64-linux.gcc-serial/bin/cmake -E cmake_progress_report /home/adel/parsec-2.1/pkgs/apps/raytrace/obj/amd64-linux.gcc-serial/CMakeFiles 16
[ 72%] Building CXX object LRT/CMakeFiles/LRT.dir/FrameBuffer.o
cd /home/adel/parsec-2.1/pkgs/apps/raytrace/obj/amd64-linux.gcc-serial/LRT && /usr/bin/g++   -DTHIS_IS_CMAKE -I/home/adel/parsec-2.1/bin/../pkgs/libs/mesa/inst/amd64-linux.gcc-serial/include -O3 -funroll-loops -fprefetch-loop-arrays -fpermissive -fno-exceptions -static-libgcc -Wl,--hash-style=both,--as-needed -DPARSEC_VERSION=2.1 -fexceptions -fno-strict-aliasing -fno-align-labels -DNDEBUG -D_MM_NO_ALIGN_CHECK  -I/home/adel/parsec-2.1/pkgs/libs/mesa/inst/amd64-linux.gcc-serial/include -I/home/adel/parsec-2.1/pkgs/apps/raytrace/obj/amd64-linux.gcc-serial -I/home/adel/parsec-2.1/pkgs/apps/raytrace/obj/amd64-linux.gcc-serial/RTTL -I/home/adel/parsec-2.1/pkgs/apps/raytrace/obj/amd64-linux.gcc-serial/RTTL/common -I/home/adel/parsec-2.1/pkgs/apps/raytrace/obj/amd64-linux.gcc-serial/RTTL/BVH -I/home/adel/parsec-2.1/pkgs/apps/raytrace/obj/amd64-linux.gcc-serial/SG -I/home/adel/parsec-2.1/pkgs/apps/raytrace/obj/amd64-linux.gcc-serial/LRT/include -I/home/adel/parsec-2.1/pkgs/apps/raytrace/obj/amd64-linux.gcc-serial/LRT   -D__root__ -o CMakeFiles/LRT.dir/FrameBuffer.o -c /home/adel/parsec-2.1/pkgs/apps/raytrace/obj/amd64-linux.gcc-serial/LRT/FrameBuffer.cxx
/home/adel/parsec-2.1/pkgs/tools/cmake/inst/amd64-linux.gcc-serial/bin/cmake -E cmake_progress_report /home/adel/parsec-2.1/pkgs/apps/raytrace/obj/amd64-linux.gcc-serial/CMakeFiles 17
[ 77%] Building CXX object LRT/CMakeFiles/LRT.dir/FrameBuffer/PBOFrameBuffer.o
cd /home/adel/parsec-2.1/pkgs/apps/raytrace/obj/amd64-linux.gcc-serial/LRT && /usr/bin/g++   -DTHIS_IS_CMAKE -I/home/adel/parsec-2.1/bin/../pkgs/libs/mesa/inst/amd64-linux.gcc-serial/include -O3 -funroll-loops -fprefetch-loop-arrays -fpermissive -fno-exceptions -static-libgcc -Wl,--hash-style=both,--as-needed -DPARSEC_VERSION=2.1 -fexceptions -fno-strict-aliasing -fno-align-labels -DNDEBUG -D_MM_NO_ALIGN_CHECK  -I/home/adel/parsec-2.1/pkgs/libs/mesa/inst/amd64-linux.gcc-serial/include -I/home/adel/parsec-2.1/pkgs/apps/raytrace/obj/amd64-linux.gcc-serial -I/home/adel/parsec-2.1/pkgs/apps/raytrace/obj/amd64-linux.gcc-serial/RTTL -I/home/adel/parsec-2.1/pkgs/apps/raytrace/obj/amd64-linux.gcc-serial/RTTL/common -I/home/adel/parsec-2.1/pkgs/apps/raytrace/obj/amd64-linux.gcc-serial/RTTL/BVH -I/home/adel/parsec-2.1/pkgs/apps/raytrace/obj/amd64-linux.gcc-serial/SG -I/home/adel/parsec-2.1/pkgs/apps/raytrace/obj/amd64-linux.gcc-serial/LRT/include -I/home/adel/parsec-2.1/pkgs/apps/raytrace/obj/amd64-linux.gcc-serial/LRT   -D__root__ -o CMakeFiles/LRT.dir/FrameBuffer/PBOFrameBuffer.o -c /home/adel/parsec-2.1/pkgs/apps/raytrace/obj/amd64-linux.gcc-serial/LRT/FrameBuffer/PBOFrameBuffer.cxx
/home/adel/parsec-2.1/pkgs/tools/cmake/inst/amd64-linux.gcc-serial/bin/cmake -E cmake_progress_report /home/adel/parsec-2.1/pkgs/apps/raytrace/obj/amd64-linux.gcc-serial/CMakeFiles 18
[ 81%] Building CXX object LRT/CMakeFiles/LRT.dir/FrameBuffer/GLTextureFB.o
cd /home/adel/parsec-2.1/pkgs/apps/raytrace/obj/amd64-linux.gcc-serial/LRT && /usr/bin/g++   -DTHIS_IS_CMAKE -I/home/adel/parsec-2.1/bin/../pkgs/libs/mesa/inst/amd64-linux.gcc-serial/include -O3 -funroll-loops -fprefetch-loop-arrays -fpermissive -fno-exceptions -static-libgcc -Wl,--hash-style=both,--as-needed -DPARSEC_VERSION=2.1 -fexceptions -fno-strict-aliasing -fno-align-labels -DNDEBUG -D_MM_NO_ALIGN_CHECK  -I/home/adel/parsec-2.1/pkgs/libs/mesa/inst/amd64-linux.gcc-serial/include -I/home/adel/parsec-2.1/pkgs/apps/raytrace/obj/amd64-linux.gcc-serial -I/home/adel/parsec-2.1/pkgs/apps/raytrace/obj/amd64-linux.gcc-serial/RTTL -I/home/adel/parsec-2.1/pkgs/apps/raytrace/obj/amd64-linux.gcc-serial/RTTL/common -I/home/adel/parsec-2.1/pkgs/apps/raytrace/obj/amd64-linux.gcc-serial/RTTL/BVH -I/home/adel/parsec-2.1/pkgs/apps/raytrace/obj/amd64-linux.gcc-serial/SG -I/home/adel/parsec-2.1/pkgs/apps/raytrace/obj/amd64-linux.gcc-serial/LRT/include -I/home/adel/parsec-2.1/pkgs/apps/raytrace/obj/amd64-linux.gcc-serial/LRT   -D__root__ -o CMakeFiles/LRT.dir/FrameBuffer/GLTextureFB.o -c /home/adel/parsec-2.1/pkgs/apps/raytrace/obj/amd64-linux.gcc-serial/LRT/FrameBuffer/GLTextureFB.cxx
/home/adel/parsec-2.1/pkgs/tools/cmake/inst/amd64-linux.gcc-serial/bin/cmake -E cmake_progress_report /home/adel/parsec-2.1/pkgs/apps/raytrace/obj/amd64-linux.gcc-serial/CMakeFiles 19
[ 86%] Building CXX object LRT/CMakeFiles/LRT.dir/render.o
cd /home/adel/parsec-2.1/pkgs/apps/raytrace/obj/amd64-linux.gcc-serial/LRT && /usr/bin/g++   -DTHIS_IS_CMAKE -I/home/adel/parsec-2.1/bin/../pkgs/libs/mesa/inst/amd64-linux.gcc-serial/include -O3 -funroll-loops -fprefetch-loop-arrays -fpermissive -fno-exceptions -static-libgcc -Wl,--hash-style=both,--as-needed -DPARSEC_VERSION=2.1 -fexceptions -fno-strict-aliasing -fno-align-labels -DNDEBUG -D_MM_NO_ALIGN_CHECK  -I/home/adel/parsec-2.1/pkgs/libs/mesa/inst/amd64-linux.gcc-serial/include -I/home/adel/parsec-2.1/pkgs/apps/raytrace/obj/amd64-linux.gcc-serial -I/home/adel/parsec-2.1/pkgs/apps/raytrace/obj/amd64-linux.gcc-serial/RTTL -I/home/adel/parsec-2.1/pkgs/apps/raytrace/obj/amd64-linux.gcc-serial/RTTL/common -I/home/adel/parsec-2.1/pkgs/apps/raytrace/obj/amd64-linux.gcc-serial/RTTL/BVH -I/home/adel/parsec-2.1/pkgs/apps/raytrace/obj/amd64-linux.gcc-serial/SG -I/home/adel/parsec-2.1/pkgs/apps/raytrace/obj/amd64-linux.gcc-serial/LRT/include -I/home/adel/parsec-2.1/pkgs/apps/raytrace/obj/amd64-linux.gcc-serial/LRT   -D__root__ -o CMakeFiles/LRT.dir/render.o -c /home/adel/parsec-2.1/pkgs/apps/raytrace/obj/amd64-linux.gcc-serial/LRT/render.cxx
In file included from /home/adel/parsec-2.1/pkgs/apps/raytrace/obj/amd64-linux.gcc-serial/LRT/render.cxx:3:0:
/home/adel/parsec-2.1/pkgs/apps/raytrace/obj/amd64-linux.gcc-serial/RTTL/common/RTThread.hxx: In function 'int atomic_add(atomic_t*, int)':
/home/adel/parsec-2.1/pkgs/apps/raytrace/obj/amd64-linux.gcc-serial/RTTL/common/RTThread.hxx:21:40: warning: invalid conversion from 'atomic_t* {aka volatile int*}' to 'volatile unsigned int*' [-fpermissive]
     flag=atomic_cmpset_32(v, temp_v, rv);
                                        ^
In file included from /home/adel/parsec-2.1/pkgs/apps/raytrace/obj/amd64-linux.gcc-serial/RTTL/common/atomic/atomic.h:28:0,
                 from /home/adel/parsec-2.1/pkgs/apps/raytrace/obj/amd64-linux.gcc-serial/RTTL/common/RTThread.hxx:10,
                 from /home/adel/parsec-2.1/pkgs/apps/raytrace/obj/amd64-linux.gcc-serial/LRT/render.cxx:3:
/home/adel/parsec-2.1/pkgs/apps/raytrace/obj/amd64-linux.gcc-serial/RTTL/common/atomic/amd64/atomic.h:88:1: warning:   initializing argument 1 of 'int atomic_cmpset_int(volatile unsigned int*, unsigned int, unsigned int)' [-fpermissive]
 atomic_cmpset_int(volatile u_int *dst, u_int exp, u_int src)
 ^
/home/adel/parsec-2.1/pkgs/apps/raytrace/obj/amd64-linux.gcc-serial/LRT/render.cxx: In function 'LRTvoid lrtDestroyContext(LRTContext)':
/home/adel/parsec-2.1/pkgs/apps/raytrace/obj/amd64-linux.gcc-serial/LRT/render.cxx:903:10: warning: deleting 'LRTContext {aka void*}' is undefined [enabled by default]
   delete context;
          ^
/home/adel/parsec-2.1/pkgs/apps/raytrace/obj/amd64-linux.gcc-serial/LRT/render.cxx: In function 'LRTvoid lrtDestroyCamera(LRTCamera)':
/home/adel/parsec-2.1/pkgs/apps/raytrace/obj/amd64-linux.gcc-serial/LRT/render.cxx:915:10: warning: deleting 'LRTCamera {aka void*}' is undefined [enabled by default]
   delete camera;
          ^
Linking CXX static library ../lib/libLRT.a
cd /home/adel/parsec-2.1/pkgs/apps/raytrace/obj/amd64-linux.gcc-serial/LRT && /home/adel/parsec-2.1/pkgs/tools/cmake/inst/amd64-linux.gcc-serial/bin/cmake -P CMakeFiles/LRT.dir/cmake_clean_target.cmake
cd /home/adel/parsec-2.1/pkgs/apps/raytrace/obj/amd64-linux.gcc-serial/LRT && /home/adel/parsec-2.1/pkgs/tools/cmake/inst/amd64-linux.gcc-serial/bin/cmake -E cmake_link_script CMakeFiles/LRT.dir/link.txt --verbose=1
/usr/bin/ar cr ../lib/libLRT.a  CMakeFiles/LRT.dir/Init.o CMakeFiles/LRT.dir/FrameBuffer.o CMakeFiles/LRT.dir/FrameBuffer/PBOFrameBuffer.o CMakeFiles/LRT.dir/FrameBuffer/GLTextureFB.o CMakeFiles/LRT.dir/render.o
/usr/bin/ranlib ../lib/libLRT.a
make[2]: Leaving directory `/home/adel/parsec-2.1/pkgs/apps/raytrace/obj/amd64-linux.gcc-serial'
/home/adel/parsec-2.1/pkgs/tools/cmake/inst/amd64-linux.gcc-serial/bin/cmake -E cmake_progress_report /home/adel/parsec-2.1/pkgs/apps/raytrace/obj/amd64-linux.gcc-serial/CMakeFiles  15 16 17 18 19
[ 86%] Built target LRT
/usr/bin/make -f LRT/CMakeFiles/test_static_cube.dir/build.make LRT/CMakeFiles/test_static_cube.dir/depend
make[2]: Entering directory `/home/adel/parsec-2.1/pkgs/apps/raytrace/obj/amd64-linux.gcc-serial'
cd /home/adel/parsec-2.1/pkgs/apps/raytrace/obj/amd64-linux.gcc-serial && /home/adel/parsec-2.1/pkgs/tools/cmake/inst/amd64-linux.gcc-serial/bin/cmake -E cmake_depends "Unix Makefiles" /home/adel/parsec-2.1/pkgs/apps/raytrace/obj/amd64-linux.gcc-serial /home/adel/parsec-2.1/pkgs/apps/raytrace/obj/amd64-linux.gcc-serial/LRT /home/adel/parsec-2.1/pkgs/apps/raytrace/obj/amd64-linux.gcc-serial /home/adel/parsec-2.1/pkgs/apps/raytrace/obj/amd64-linux.gcc-serial/LRT /home/adel/parsec-2.1/pkgs/apps/raytrace/obj/amd64-linux.gcc-serial/LRT/CMakeFiles/test_static_cube.dir/DependInfo.cmake --color=
Scanning dependencies of target test_static_cube
make[2]: Leaving directory `/home/adel/parsec-2.1/pkgs/apps/raytrace/obj/amd64-linux.gcc-serial'
/usr/bin/make -f LRT/CMakeFiles/test_static_cube.dir/build.make LRT/CMakeFiles/test_static_cube.dir/build
make[2]: Entering directory `/home/adel/parsec-2.1/pkgs/apps/raytrace/obj/amd64-linux.gcc-serial'
/home/adel/parsec-2.1/pkgs/tools/cmake/inst/amd64-linux.gcc-serial/bin/cmake -E cmake_progress_report /home/adel/parsec-2.1/pkgs/apps/raytrace/obj/amd64-linux.gcc-serial/CMakeFiles 20
[ 90%] Building CXX object LRT/CMakeFiles/test_static_cube.dir/test/api_static_cube/static_cube.o
cd /home/adel/parsec-2.1/pkgs/apps/raytrace/obj/amd64-linux.gcc-serial/LRT && /usr/bin/g++   -DTHIS_IS_CMAKE -I/home/adel/parsec-2.1/bin/../pkgs/libs/mesa/inst/amd64-linux.gcc-serial/include -O3 -funroll-loops -fprefetch-loop-arrays -fpermissive -fno-exceptions -static-libgcc -Wl,--hash-style=both,--as-needed -DPARSEC_VERSION=2.1 -fexceptions -fno-strict-aliasing -fno-align-labels -DNDEBUG -D_MM_NO_ALIGN_CHECK  -I/home/adel/parsec-2.1/pkgs/libs/mesa/inst/amd64-linux.gcc-serial/include -I/home/adel/parsec-2.1/pkgs/apps/raytrace/obj/amd64-linux.gcc-serial -I/home/adel/parsec-2.1/pkgs/apps/raytrace/obj/amd64-linux.gcc-serial/RTTL -I/home/adel/parsec-2.1/pkgs/apps/raytrace/obj/amd64-linux.gcc-serial/RTTL/common -I/home/adel/parsec-2.1/pkgs/apps/raytrace/obj/amd64-linux.gcc-serial/RTTL/BVH -I/home/adel/parsec-2.1/pkgs/apps/raytrace/obj/amd64-linux.gcc-serial/SG -I/home/adel/parsec-2.1/pkgs/apps/raytrace/obj/amd64-linux.gcc-serial/LRT/include -I/home/adel/parsec-2.1/pkgs/apps/raytrace/obj/amd64-linux.gcc-serial/LRT   -D__root__ -o CMakeFiles/test_static_cube.dir/test/api_static_cube/static_cube.o -c /home/adel/parsec-2.1/pkgs/apps/raytrace/obj/amd64-linux.gcc-serial/LRT/test/api_static_cube/static_cube.cxx
Linking CXX executable ../bin/test_static_cube
cd /home/adel/parsec-2.1/pkgs/apps/raytrace/obj/amd64-linux.gcc-serial/LRT && /home/adel/parsec-2.1/pkgs/tools/cmake/inst/amd64-linux.gcc-serial/bin/cmake -E cmake_link_script CMakeFiles/test_static_cube.dir/link.txt --verbose=1
/usr/bin/g++   -I/home/adel/parsec-2.1/bin/../pkgs/libs/mesa/inst/amd64-linux.gcc-serial/include -O3 -funroll-loops -fprefetch-loop-arrays -fpermissive -fno-exceptions -static-libgcc -Wl,--hash-style=both,--as-needed -DPARSEC_VERSION=2.1 -fexceptions -fno-strict-aliasing -fno-align-labels -DNDEBUG -D_MM_NO_ALIGN_CHECK   -fPIC -L/home/adel/parsec-2.1/bin/../pkgs/libs/mesa/inst/amd64-linux.gcc-serial/lib -lXext -L/usr/lib64 -L/usr/lib CMakeFiles/test_static_cube.dir/test/api_static_cube/static_cube.o  -o ../bin/test_static_cube -rdynamic -L/home/adel/parsec-2.1/pkgs/apps/raytrace/obj/amd64-linux.gcc-serial/lib -L/home/adel/parsec-2.1/pkgs/libs/mesa/inst/amd64-linux.gcc-serial/lib ../lib/libLRT.a /home/adel/parsec-2.1/pkgs/libs/mesa/inst/amd64-linux.gcc-serial/lib/libGLU.a /home/adel/parsec-2.1/pkgs/libs/mesa/inst/amd64-linux.gcc-serial/lib/libGL.a ../lib/libRTTL.a /home/adel/parsec-2.1/pkgs/libs/mesa/inst/amd64-linux.gcc-serial/lib/libglut.a -lXext -lXmu -lX11 -lGL -lGLU -lpthread -lstdc++ -lpthread
/usr/bin/ld: /home/adel/parsec-2.1/bin/../pkgs/libs/mesa/inst/amd64-linux.gcc-serial/lib/libGL.a(xm_api.o): undefined reference to symbol 'XShmQueryVersion'
/usr/lib/gcc/x86_64-linux-gnu/4.8/../../../x86_64-linux-gnu/libXext.so: error adding symbols: DSO missing from command line
collect2: error: ld returned 1 exit status
make[2]: *** [bin/test_static_cube] Error 1
make[2]: Leaving directory `/home/adel/parsec-2.1/pkgs/apps/raytrace/obj/amd64-linux.gcc-serial'
make[1]: *** [LRT/CMakeFiles/test_static_cube.dir/all] Error 2
make[1]: Leaving directory `/home/adel/parsec-2.1/pkgs/apps/raytrace/obj/amd64-linux.gcc-serial'
make: *** [all] Error 2
[PARSEC] Error: 'env CXXFLAGS=-I/home/adel/parsec-2.1/bin/../pkgs/libs/mesa/inst/amd64-linux.gcc-serial/include -O3 -funroll-loops -fprefetch-loop-arrays -fpermissive -fno-exceptions -static-libgcc -Wl,--hash-style=both,--as-needed -DPARSEC_VERSION=2.1 -fexceptions -fno-strict-aliasing -fno-align-labels -DNDEBUG -D_MM_NO_ALIGN_CHECK LDFLAGS=-L/home/adel/parsec-2.1/bin/../pkgs/libs/mesa/inst/amd64-linux.gcc-serial/lib -lXext -L/usr/lib64 -L/usr/lib LIBS= -lXext -lXmu -lX11 -lGL -lGLU -lpthread /usr/bin/make' failed.


Regards
--
Adel Ejjeh
Graduate and Research Assistant
Electrical & Computer Engineering Department
American University of Beirut
aje02 at mail.aub.edu<mailto:aje02 at mail.aub.edu> | adel.ejjeh at gmail.com<mailto:adel.ejjeh at gmail.com>
Beirut, Lebanon



-------------- next part --------------
An HTML attachment was scrubbed...
URL: <http://lists.cs.princeton.edu/pipermail/parsec-users/attachments/20140613/5a99845b/attachment-0001.html>


More information about the parsec-users mailing list