[sndtools] compile time error

Leandro Chescotta leandro.chescotta at gmail.com
Mon Jun 15 07:38:48 EDT 2009


the command...

make linux-alsa

gives me the following error...

make -f makefile.alsa
make[1]: Entering directory
`/home/aleyscha/bin/arch_packages/sndpeek/src/sndpeek-1.3/src/sndpeek'
gcc -D__LINUX_ALSA__ -D__LITTLE_ENDIAN__ -I../marsyas/ -O3 -c RtAudio.cpp
RtAudio.cpp: In member function ?void RtApi::openStream(int, int, int,
int, RtAudioFormat, int, int*, int)?:
RtAudio.cpp:234: error: ?sprintf? was not declared in this scope
RtAudio.cpp:239: error: ?sprintf? was not declared in this scope
RtAudio.cpp:244: error: ?sprintf? was not declared in this scope
RtAudio.cpp:250: error: ?sprintf? was not declared in this scope
RtAudio.cpp:257: error: ?sprintf? was not declared in this scope
RtAudio.cpp:339: error: ?sprintf? was not declared in this scope
RtAudio.cpp:341: error: ?sprintf? was not declared in this scope
RtAudio.cpp: In member function ?RtAudioDeviceInfo RtApi::getDeviceInfo(int)?:
RtAudio.cpp:355: error: ?sprintf? was not declared in this scope
make[1]: *** [RtAudio.o] Error 1
make[1]: Leaving directory
`/home/aleyscha/bin/arch_packages/sndpeek/src/sndpeek-1.3/src/sndpeek'
make: [linux-alsa] Error 2 (ignored)

any clue? i have libsndfile installed

thanks!


More information about the sndtools mailing list